program: Orca
programVersion: 5.0.4
elementType: Cl Cl Cl P O O O O C C C C C C C C C C C C H H H H H H H H H H H H H H
charge: 0
multiplicity: 1
keywords: wb97x-d3
keywords: def2-TZVPP
keywords: def2/J RIJCOSX
keywords: DEFGRID2
keywords: scfconv7
keywords: smallprint printgap noloewdin
keywords: NOSOSCF
formula: C12H14Cl3O4P
InChI: InChI=1/C12H14Cl3O4P/c1-3-17-20(16,18-4-2)19-12(8-13)10-6-5-9(14)7-11(10)15/h5-8H,3-4H2,1-2H3
34 atoms
Cl -1.236326 0.720118 2.533765
Cl -4.439849 1.196925 -1.72003
Cl -1.167534 -2.787823 2.520725
P  1.954912 0.391381 -0.346337
O  1.557166 -1.026226 0.329492
O  3.532499 0.368614 -0.210888
O  1.727881 0.047358 -1.874563
O  1.257872 1.569055 0.202147
C  -0.863246 -0.696939 0.253865
C  0.325406 -1.32341 0.862396
C  4.202247 0.89381 0.96004
C  1.877172 1.052208 -2.903868
C  -1.639171 0.243973 0.927172
C  -1.219389 -1.033277 -1.049014
C  5.044642 2.080367 0.572275
C  1.059863 0.630844 -4.096225
C  -2.741596 0.83083 0.328355
C  -2.314845 -0.459682 -1.669654
C  -3.066916 0.468299 -0.968209
C  0.303989 -2.222738 1.837841
H  3.479879 1.167946 1.731301
H  4.814379 0.082885 1.354536
H  1.543425 2.022426 -2.530941
H  2.93553 1.130437 -3.158187
H  -0.635079 -1.768294 -1.586857
H  5.783971 1.816541 -0.184733
H  4.431149 2.898495 0.193166
H  5.58166 2.443214 1.449694
H  1.380752 -0.336498 -4.483515
H  -0.001799 0.577281 -3.853321
H  1.184481 1.366048 -4.891657
H  -3.332327 1.561473 0.86333
H  -2.576176 -0.739758 -2.680553
H  1.201871 -2.66622 2.247793
elementType: Cl P O C H
totalener: -2488.79959837 hartree
nucrepener: 2286.15685393 hartree
electener: -4774.95645230 hartree
oneelecener: -7977.04400723 hartree
twoeener: 3202.08755493 hartree
cpcmener: -0.02462515 hartree
kineticenergy: 2482.70656846 hartree
xcener: -152.811788903829 hartree
chargesum: -0.0000000
charge: -0.057847 -0.075930 -0.077767 0.938171 -0.315436 -0.357345 -0.338791 -0.599300 0.015912 0.132430 0.048544 0.036995 0.023932 -0.168924 -0.242394 -0.246926 -0.109610 -0.141178 0.088580 -0.072816 0.090964 0.102650 0.098641 0.109501 0.155130 0.088295 0.086338 0.093257 0.091221 0.083856 0.094972 0.123689 0.147784 0.153403
qa: -0.0578 -0.0759 -0.0778 0.9382 -0.3154 -0.3573 -0.3388 -0.5993 0.0159 0.1324 0.0485 0.0370 0.0239 -0.1689 -0.2424 -0.2469 -0.1096 -0.1412 0.0886 -0.0728 0.0910 0.1026 0.0986 0.1095 0.1551 0.0883 0.0863 0.0933 0.0912 0.0839 0.0950 0.1237 0.1478 0.1534
va: 1.2623 1.2284 1.2431 5.6206 2.1385 2.1165 2.1149 1.9802 3.5625 3.8437 3.8616 3.8410 3.9406 3.9190 3.9384 3.9541 4.0341 3.9559 3.8850 4.0290 1.0034 0.9951 0.9976 0.9939 1.0048 1.0031 1.0091 1.0084 1.0034 1.0022 1.0084 1.0203 1.0024 1.0001
dispcorr: -0.019316863 hartree
energy: -2488.818915234222
dipole: 32.10656 -30.46366 1.64290 9.52694 -9.69927 -0.17233 -18.93332 17.69531 -1.23801
magnitude: 2.06434 au
magnitude: 5.24712 debye
