program: Orca
programVersion: 5.0.4
elementType: Cl Cl Cl P O O O O C C C C C C C C C C C C H H H H H H H H H H H H H H
charge: 0
multiplicity: 1
keywords: wb97x-d3
keywords: def2-TZVPP
keywords: def2/J RIJCOSX
keywords: DEFGRID2
keywords: scfconv7
keywords: smallprint printgap noloewdin
keywords: NOSOSCF
formula: C12H14Cl3O4P
InChI: InChI=1/C12H14Cl3O4P/c1-3-17-20(16,18-4-2)19-12(8-13)10-6-5-9(14)7-11(10)15/h5-8H,3-4H2,1-2H3
34 atoms
Cl -1.792424 1.953511 1.975933
Cl -5.100763 -0.448446 -1.47017
Cl -0.22394 -0.97997 3.057408
P  2.715615 0.2000 -0.530693
O  1.266801 0.814671 -0.134601
O  2.317875 -1.250293 -1.039672
O  3.075898 1.06928 -1.794983
O  3.755636 0.268937 0.511264
C  -0.957667 0.05447 0.228674
C  0.411188 0.208222 0.755783
C  3.061665 -2.443157 -0.700717
C  2.245058 1.193644 -2.972873
C  -2.030083 0.797136 0.71727
C  -1.198097 -0.832928 -0.817417
C  2.558137 -3.063032 0.578886
C  1.639767 2.571629 -3.044482
C  -3.308318 0.649934 0.201733
C  -2.464348 -0.999948 -1.347785
C  -3.51006 -0.254892 -0.82632
C  0.822442 -0.176292 1.958015
H  2.912484 -3.115689 -1.544111
H  4.128486 -2.220147 -0.639454
H  2.905767 1.011842 -3.820271
H  1.472113 0.422729 -2.990022
H  -0.38082 -1.418275 -1.217132
H  1.488785 -3.274322 0.530437
H  3.076533 -4.009428 0.742281
H  2.750702 -2.427941 1.443777
H  2.407231 3.345997 -3.017214
H  1.099339 2.672938 -3.98646
H  0.933505 2.750015 -2.233721
H  -4.128275 1.23522 0.594749
H  -2.629504 -1.703578 -2.151832
H  1.82387 -0.009028 2.330571
elementType: Cl P O C H
totalener: -2488.80024860 hartree
nucrepener: 2270.70808056 hartree
electener: -4759.50832915 hartree
oneelecener: -7944.67166689 hartree
twoeener: 3185.16333773 hartree
cpcmener: -0.02502549 hartree
kineticenergy: 2482.68481856 hartree
xcener: -152.809595807058 hartree
chargesum: 0.0000000
charge: -0.057504 -0.076580 -0.078351 0.886546 -0.321051 -0.331427 -0.347402 -0.604114 0.044999 0.132176 0.047402 0.048982 0.010497 -0.163891 -0.255802 -0.243445 -0.120191 -0.154620 0.089688 -0.054930 0.107660 0.103401 0.108751 0.094798 0.155075 0.087409 0.108489 0.087158 0.089667 0.093145 0.084434 0.126619 0.145965 0.156446
qa: -0.0575 -0.0766 -0.0784 0.8865 -0.3211 -0.3314 -0.3474 -0.6041 0.0450 0.1322 0.0474 0.0490 0.0105 -0.1639 -0.2558 -0.2434 -0.1202 -0.1546 0.0897 -0.0549 0.1077 0.1034 0.1088 0.0948 0.1551 0.0874 0.1085 0.0872 0.0897 0.0931 0.0844 0.1266 0.1460 0.1564
va: 1.2651 1.2264 1.2349 5.6284 2.0867 2.0583 2.1224 2.0016 3.5577 3.8026 3.8284 3.8502 3.9722 3.9194 3.9222 3.9375 4.0336 4.0385 3.8784 4.0111 0.9939 1.0043 0.9957 0.9965 1.0090 1.0032 1.0110 1.0083 1.0041 1.0079 1.0104 1.0199 1.0053 1.0144
dispcorr: -0.019931038 hartree
energy: -2488.820179635235
dipole: 24.41260 -24.91071 -0.49811 -7.30565 5.98109 -1.32456 -19.11371 16.99263 -2.12109
magnitude: 2.54982 au
magnitude: 6.48112 debye
