program: Orca
programVersion: 5.0.4
elementType: Cl Cl Cl P O O O O C C C C C C C C C C C C H H H H H H H H H H H H H H
charge: 0
multiplicity: 1
keywords: wb97x-d3
keywords: def2-TZVPP
keywords: def2/J RIJCOSX
keywords: DEFGRID2
keywords: scfconv7
keywords: smallprint printgap noloewdin
keywords: NOSOSCF
formula: C12H14Cl3O4P
InChI: InChI=1/C12H14Cl3O4P/c1-3-17-20(16,18-4-2)19-12(8-13)10-6-5-9(14)7-11(10)15/h5-8H,3-4H2,1-2H3
34 atoms
Cl -1.335283 1.298545 1.852338
Cl -4.590048 0.381611 -2.291556
Cl -1.127564 -1.904922 3.121912
P  2.104026 0.282845 -0.072186
O  1.365708 -1.138618 0.181772
O  3.301314 -0.175909 -0.997091
O  1.120804 0.990442 -1.090521
O  2.437267 1.02418 1.158892
C  -1.018167 -0.811459 0.182426
C  0.200213 -1.195781 0.918464
C  4.477534 -0.819308 -0.458055
C  1.040409 2.43055 -1.191429
C  -1.779989 0.305843 0.512929
C  -1.381891 -1.541618 -0.946502
C  5.701994 -0.208449 -1.085834
C  2.268248 3.032716 -1.828329
C  -2.884072 0.678412 -0.237869
C  -2.479791 -1.193204 -1.711179
C  -3.222102 -0.081487 -1.344529
C  0.269667 -1.658457 2.158821
H  4.511694 -0.713637 0.628281
H  4.40288 -1.882537 -0.688589
H  0.156773 2.61155 -1.800502
H  0.857826 2.856184 -0.203666
H  -0.795874 -2.406224 -1.230744
H  6.588015 -0.724185 -0.713772
H  5.691091 -0.307554 -2.171733
H  5.796277 0.847341 -0.831027
H  2.102045 4.100704 -1.974744
H  3.154203 2.924587 -1.200881
H  2.47344 2.58982 -2.803026
H  -3.460853 1.552087 0.032172
H  -2.746391 -1.778484 -2.580186
H  1.206123 -1.933935 2.626106
elementType: Cl P O C H
totalener: -2488.80061353 hartree
nucrepener: 2290.06491096 hartree
electener: -4778.86552449 hartree
oneelecener: -7984.66381335 hartree
twoeener: 3205.79828886 hartree
cpcmener: -0.02521918 hartree
kineticenergy: 2482.72655793 hartree
xcener: -152.813340967878 hartree
chargesum: 0.0000000
charge: -0.061305 -0.076945 -0.068876 0.927360 -0.340951 -0.348494 -0.344929 -0.604953 0.038147 0.105429 0.049293 0.049537 -0.007549 -0.138578 -0.242606 -0.249070 -0.105171 -0.148433 0.085439 -0.039560 0.094827 0.103061 0.105757 0.094642 0.148950 0.090821 0.089938 0.087056 0.098102 0.086685 0.092773 0.128171 0.147564 0.153866
qa: -0.0613 -0.0769 -0.0689 0.9274 -0.3410 -0.3485 -0.3449 -0.6050 0.0381 0.1054 0.0493 0.0495 -0.0075 -0.1386 -0.2426 -0.2491 -0.1052 -0.1484 0.0854 -0.0396 0.0948 0.1031 0.1058 0.0946 0.1490 0.0908 0.0899 0.0871 0.0981 0.0867 0.0928 0.1282 0.1476 0.1539
va: 1.2600 1.2260 1.2539 5.6224 2.1030 2.1176 2.1024 1.9792 3.5923 3.8336 3.8460 3.8307 3.9140 3.9468 3.9464 3.9363 4.0117 3.9901 3.8840 4.0963 1.0009 0.9945 0.9897 1.0071 1.0025 1.0080 1.0028 1.0056 1.0084 1.0119 1.0046 1.0182 1.0027 0.9982
dispcorr: -0.019565211 hartree
energy: -2488.820178745676
dipole: 35.99679 -35.05835 0.93845 7.15498 -7.59411 -0.43913 -15.83340 14.36652 -1.46688
magnitude: 1.79590 au
magnitude: 4.56482 debye
