program: Orca
programVersion: 5.0.4
elementType: Cl Cl Cl P O O O O C C C C C C C C C C C C H H H H H H H H H H H H H H
charge: 0
multiplicity: 1
keywords: wb97x-d3
keywords: def2-TZVPP
keywords: def2/J RIJCOSX
keywords: DEFGRID2
keywords: scfconv7
keywords: smallprint printgap noloewdin
keywords: NOSOSCF
formula: C12H14Cl3O4P
InChI: InChI=1/C12H14Cl3O4P/c1-3-17-20(16,18-4-2)19-12(8-13)10-6-5-9(14)7-11(10)15/h5-8H,3-4H2,1-2H3
34 atoms
Cl -1.341318 1.350171 1.676335
Cl -4.4251 0.225974 -2.548583
Cl -1.387052 -1.842085 3.055582
P  2.256764 0.200158 0.340378
O  1.412744 -1.18341 0.372266
O  3.517675 -0.226725 -0.508715
O  1.316347 1.099564 -0.570353
O  2.621834 0.754879 1.655024
C  -0.966604 -0.84437 0.132327
C  0.175703 -1.220528 0.984921
C  3.440277 -0.862384 -1.804423
C  1.392978 2.540655 -0.572316
C  -1.730688 0.295809 0.367014
C  -1.281577 -1.629483 -0.973333
C  4.620503 -0.419143 -2.62807
C  2.613547 3.047371 -1.302122
C  -2.797072 0.634198 -0.450289
C  -2.340193 -1.313717 -1.806017
C  -3.092186 -0.183087 -1.52883
C  0.108195 -1.653109 2.236563
H  3.453862 -1.942176 -1.648486
H  2.505689 -0.604504 -2.306682
H  0.480704 2.865558 -1.0718
H  1.362181 2.910984 0.453975
H  -0.693073 -2.514301 -1.180253
H  4.597146 -0.934167 -3.589106
H  4.59535 0.653851 -2.821791
H  5.565357 -0.664287 -2.141667
H  2.670089 2.647851 -2.315556
H  2.552507 4.134033 -1.377653
H  3.539703 2.808555 -0.77684
H  -3.381114 1.522281 -0.251613
H  -2.573804 -1.944175 -2.652987
H  0.98513 -1.921446 2.811452
elementType: Cl P O C H
totalener: -2488.80110863 hartree
nucrepener: 2300.71710989 hartree
electener: -4789.51821851 hartree
oneelecener: -8005.41225336 hartree
twoeener: 3215.89403485 hartree
cpcmener: -0.02742575 hartree
kineticenergy: 2482.70142480 hartree
xcener: -152.810251937511 hartree
chargesum: 0.0000000
charge: -0.064698 -0.077183 -0.067916 0.897698 -0.334553 -0.343647 -0.334114 -0.603746 0.051673 0.109185 0.028746 0.044294 -0.002298 -0.151124 -0.237648 -0.262109 -0.105756 -0.144869 0.083479 -0.038282 0.109646 0.106442 0.103877 0.098526 0.150265 0.091127 0.084692 0.091003 0.088601 0.104726 0.094329 0.127095 0.147817 0.154723
qa: -0.0647 -0.0772 -0.0679 0.8977 -0.3346 -0.3436 -0.3341 -0.6037 0.0517 0.1092 0.0287 0.0443 -0.0023 -0.1511 -0.2376 -0.2621 -0.1058 -0.1449 0.0835 -0.0383 0.1096 0.1064 0.1039 0.0985 0.1503 0.0911 0.0847 0.0910 0.0886 0.1047 0.0943 0.1271 0.1478 0.1547
va: 1.2549 1.2260 1.2549 5.6323 2.0892 2.1026 2.0573 2.0166 3.6001 3.8190 3.8380 3.8279 3.9167 3.9512 3.9481 3.9457 4.0144 3.9848 3.8820 4.1057 0.9953 0.9947 0.9871 1.0064 1.0012 1.0071 1.0056 1.0035 1.0019 1.0098 1.0085 1.0182 1.0024 0.9987
dispcorr: -0.020224180 hartree
energy: -2488.821332806698
dipole: 32.11722 -31.96587 0.15136 6.96114 -7.26648 -0.30534 -20.82833 18.16476 -2.66358
magnitude: 2.68529 au
magnitude: 6.82546 debye
