program: Orca
programVersion: 5.0.4
elementType: Cl Cl Cl P O O O O C C C C C C C C C C C C H H H H H H H H H H H H H H
charge: 0
multiplicity: 1
keywords: wb97x-d3
keywords: def2-TZVPP
keywords: def2/J RIJCOSX
keywords: DEFGRID2
keywords: scfconv7
keywords: smallprint printgap noloewdin
keywords: NOSOSCF
formula: C12H14Cl3O4P
InChI: InChI=1/C12H14Cl3O4P/c1-3-17-20(16,18-4-2)19-12(8-13)10-6-5-9(14)7-11(10)15/h5-8H,3-4H2,1-2H3
34 atoms
Cl -1.375031 1.774382 1.887735
Cl -4.223723 0.207476 -2.361349
Cl -0.623067 -3.012369 2.401261
P  2.151828 0.701676 0.128403
O  1.270098 0.287209 1.420332
O  2.60408 -0.676656 -0.517048
O  1.057012 1.208911 -0.89098
O  3.202876 1.648212 0.536508
C  -0.840931 -0.50373 0.525595
C  0.322168 -0.7092 1.404932
C  3.730313 -1.412638 0.012185
C  1.353448 2.078389 -2.004799
C  -1.651459 0.623709 0.63171
C  -1.109313 -1.411296 -0.494442
C  4.976523 -1.128736 -0.788198
C  0.094435 2.826796 -2.357812
C  -2.697613 0.849998 -0.245718
C  -2.150813 -1.211565 -1.382896
C  -2.931132 -0.07445 -1.251026
C  0.527806 -1.753217 2.199713
H  3.884434 -1.181642 1.068738
H  3.449413 -2.463135 -0.054112
H  2.152822 2.770204 -1.734603
H  1.698726 1.466957 -2.840187
H  -0.477919 -2.282548 -0.608465
H  5.799311 -1.729565 -0.399045
H  4.84353 -1.385923 -1.839295
H  5.267621 -0.080421 -0.71911
H  -0.704753 2.150968 -2.66394
H  -0.257413 3.428209 -1.518973
H  0.300063 3.499319 -3.190947
H  -3.315648 1.731876 -0.147445
H  -2.340274 -1.9270 -2.171007
H  1.424268 -1.856537 2.797343
elementType: Cl P O C H
totalener: -2488.80030424 hartree
nucrepener: 2312.82938536 hartree
electener: -4801.62968960 hartree
oneelecener: -8029.48590270 hartree
twoeener: 3227.85621310 hartree
cpcmener: -0.02622975 hartree
kineticenergy: 2482.72431197 hartree
xcener: -152.813923367728 hartree
chargesum: 0.0000000
charge: -0.061077 -0.078655 -0.073265 0.904411 -0.324778 -0.336711 -0.309375 -0.616539 0.083371 0.057083 0.046022 0.023043 0.035429 -0.162736 -0.241374 -0.249586 -0.146823 -0.139747 0.098392 -0.043081 0.100228 0.105048 0.102973 0.106836 0.158999 0.093876 0.088547 0.082339 0.085529 0.087745 0.101802 0.123429 0.145568 0.153074
qa: -0.0611 -0.0787 -0.0733 0.9044 -0.3248 -0.3367 -0.3094 -0.6165 0.0834 0.0571 0.0460 0.0230 0.0354 -0.1627 -0.2414 -0.2496 -0.1468 -0.1397 0.0984 -0.0431 0.1002 0.1050 0.1030 0.1068 0.1590 0.0939 0.0885 0.0823 0.0855 0.0877 0.1018 0.1234 0.1456 0.1531
va: 1.2632 1.2221 1.2449 5.6170 2.0976 2.0620 2.1124 2.0073 3.5109 3.9041 3.8428 3.8486 3.9046 3.9844 3.9532 3.9454 4.0405 4.0113 3.8468 4.0477 0.9948 0.9927 1.0002 0.9921 0.9978 1.0082 1.0031 1.0166 0.9988 1.0058 1.0104 1.0225 1.0042 1.0013
dispcorr: -0.020818333 hartree
energy: -2488.821122571365
dipole: 27.07745 -26.71938 0.35806 2.68824 -4.01227 -1.32403 -16.35237 14.87828 -1.47410
magnitude: 2.01351 au
magnitude: 5.11794 debye
