program: Orca
programVersion: 5.0.4
elementType: Cl Cl Cl P O O O O C C C C C C C C C C C C H H H H H H H H H H H H H H
charge: 0
multiplicity: 1
keywords: wb97x-d3
keywords: def2-TZVPP
keywords: def2/J RIJCOSX
keywords: DEFGRID2
keywords: scfconv7
keywords: smallprint printgap noloewdin
keywords: NOSOSCF
formula: C12H14Cl3O4P
InChI: InChI=1/C12H14Cl3O4P/c1-3-17-20(16,18-4-2)19-12(8-13)10-6-5-9(14)7-11(10)15/h5-8H,3-4H2,1-2H3
34 atoms
Cl -1.532064 1.158211 2.060893
Cl -4.239712 0.241018 -2.453275
Cl -1.033967 -2.052468 3.058797
P  2.154243 0.647556 -0.005233
O  1.654514 -0.812044 0.48828
O  3.706647 0.41618 -0.178585
O  1.511219 0.710948 -1.456081
O  1.855475 1.76658 0.903329
C  -0.753041 -0.698797 0.241339
C  0.422772 -1.017553 1.070562
C  4.316794 -0.556438 -1.05486
C  1.386767 1.965034 -2.165636
C  -1.694617 0.263688 0.596662
C  -0.911459 -1.352002 -0.980001
C  4.813296 -1.748386 -0.276276
C  0.04342 2.602231 -1.916076
C  -2.774653 0.554776 -0.223811
C  -1.979076 -1.080864 -1.813539
C  -2.903464 -0.124415 -1.422006
C  0.414645 -1.575697 2.274267
H  3.622824 -0.859736 -1.840872
H  5.145148 -0.036117 -1.534424
H  2.201512 2.640848 -1.896904
H  1.508684 1.710249 -3.217489
H  -0.186587 -2.097937 -1.279324
H  3.997783 -2.322085 0.163065
H  5.358075 -2.4095 -0.951372
H  5.497696 -1.449149 0.518011
H  -0.046811 3.494353 -2.537382
H  -0.772386 1.929304 -2.182543
H  -0.076658 2.90744 -0.877021
H  -3.494687 1.307663 0.065534
H  -2.085814 -1.607351 -2.751864
H  1.324363 -1.789204 2.820356
elementType: Cl P O C H
totalener: -2488.79900167 hartree
nucrepener: 2318.95461090 hartree
electener: -4807.75361257 hartree
oneelecener: -8042.18571394 hartree
twoeener: 3234.43210136 hartree
cpcmener: -0.02806214 hartree
kineticenergy: 2482.70889318 hartree
xcener: -152.813874457385 hartree
chargesum: 0.0000000
charge: -0.054532 -0.078366 -0.071078 0.891148 -0.317251 -0.354695 -0.333238 -0.595626 0.023227 0.111432 0.052400 0.043552 0.021040 -0.143063 -0.246400 -0.249150 -0.122257 -0.134805 0.091594 -0.059477 0.097336 0.104616 0.105304 0.104764 0.148211 0.084151 0.094400 0.088012 0.108028 0.082793 0.083404 0.123659 0.146108 0.154759
qa: -0.0545 -0.0784 -0.0711 0.8911 -0.3173 -0.3547 -0.3332 -0.5956 0.0232 0.1114 0.0524 0.0436 0.0210 -0.1431 -0.2464 -0.2491 -0.1223 -0.1348 0.0916 -0.0595 0.0973 0.1046 0.1053 0.1048 0.1482 0.0842 0.0944 0.0880 0.1080 0.0828 0.0834 0.1237 0.1461 0.1548
va: 1.2654 1.2222 1.2520 5.6432 2.0904 2.1246 2.0558 2.0144 3.5664 3.8079 3.8447 3.8446 3.9277 3.9117 3.9416 3.9312 4.0243 3.9765 3.8473 4.0728 1.0011 0.9932 0.9979 0.9941 1.0037 1.0098 1.0076 1.0041 1.0124 0.9976 1.0156 1.0221 1.0034 0.9982
dispcorr: -0.021311880 hartree
energy: -2488.820313553890
dipole: 28.16047 -27.08603 1.07444 1.69729 -2.90095 -1.20365 -18.27718 15.78188 -2.49530
magnitude: 2.97148 au
magnitude: 7.55291 debye
