program: Orca
programVersion: 5.0.4
elementType: Cl Cl Cl P O O O O C C C C C C C C C C C C H H H H H H H H H H H H H H
charge: 0
multiplicity: 1
keywords: wb97x-d3
keywords: def2-TZVPP
keywords: def2/J RIJCOSX
keywords: DEFGRID2
keywords: scfconv7
keywords: smallprint printgap noloewdin
keywords: NOSOSCF
formula: C12H14Cl3O4P
InChI: InChI=1/C12H14Cl3O4P/c1-3-17-20(16,18-4-2)19-12(8-13)10-6-5-9(14)7-11(10)15/h5-8H,3-4H2,1-2H3
34 atoms
Cl -0.891583 1.341916 1.94204
Cl -5.190648 0.931964 -1.212435
Cl -0.681799 -1.993777 2.763232
P  2.417017 -0.021421 -0.434067
O  1.140038 -1.004766 -0.595283
O  2.99719 -0.057465 -1.90585
O  1.707457 1.38972 -0.336375
O  3.350774 -0.377425 0.652154
C  -1.127239 -0.566708 0.031045
C  0.193041 -1.106233 0.403794
C  4.062414 -0.95573 -2.28791
C  2.301568 2.486782 0.391344
C  -1.713262 0.525573 0.664243
C  -1.819891 -1.164367 -1.01961
C  3.620568 -2.397536 -2.342266
C  3.550854 3.012985 -0.27166
C  -2.961752 0.996714 0.286797
C  -3.065895 -0.714524 -1.414614
C  -3.626734 0.364187 -0.749373
C  0.484368 -1.747096 1.528565
H  4.370858 -0.609135 -3.272589
H  4.907394 -0.826826 -1.609328
H  1.526897 3.250655 0.417867
H  2.499667 2.176626 1.418481
H  -1.380536 -2.012166 -1.529296
H  4.43416 -2.997541 -2.751918
H  3.387689 -2.798659 -1.35513
H  2.752652 -2.528353 -2.988889
H  3.365361 3.302021 -1.306184
H  3.888867 3.898721 0.267914
H  4.36733 2.28965 -0.250197
H  -3.403549 1.843743 0.793344
H  -3.59059 -1.202903 -2.224001
H  1.459249 -2.168392 1.734682
elementType: Cl P O C H
totalener: -2488.80017050 hartree
nucrepener: 2275.42725687 hartree
electener: -4764.22742736 hartree
oneelecener: -7955.28000136 hartree
twoeener: 3191.05257399 hartree
cpcmener: -0.02274605 hartree
kineticenergy: 2482.71631330 hartree
xcener: -152.813514196718 hartree
chargesum: 0.0000000
charge: -0.064703 -0.077479 -0.070056 0.949407 -0.344282 -0.354167 -0.350729 -0.609424 0.036138 0.126923 0.045661 0.033404 0.004713 -0.140797 -0.251180 -0.249475 -0.119591 -0.153976 0.091026 -0.039770 0.106890 0.098526 0.104070 0.102589 0.150265 0.099107 0.088586 0.090390 0.092176 0.097508 0.087225 0.126409 0.145750 0.148867
qa: -0.0647 -0.0775 -0.0701 0.9494 -0.3443 -0.3542 -0.3507 -0.6094 0.0361 0.1269 0.0457 0.0334 0.0047 -0.1408 -0.2512 -0.2495 -0.1196 -0.1540 0.0910 -0.0398 0.1069 0.0985 0.1041 0.1026 0.1503 0.0991 0.0886 0.0904 0.0922 0.0975 0.0872 0.1264 0.1458 0.1489
va: 1.2530 1.2257 1.2517 5.5928 2.0945 2.1047 2.1126 1.9704 3.6384 3.7909 3.8480 3.8451 3.9491 3.9443 3.9109 3.9376 4.0297 3.9975 3.8829 4.0821 0.9909 1.0033 0.9927 1.0005 1.0023 1.0088 1.0115 1.0059 1.0049 1.0078 1.0132 1.0192 1.0041 1.0090
dispcorr: -0.019034194 hartree
energy: -2488.819204691091
dipole: 33.64859 -33.04522 0.60338 1.27740 -1.16714 0.11025 -16.32644 14.96000 -1.36644
magnitude: 1.49779 au
magnitude: 3.80709 debye
