program: Orca
programVersion: 5.0.4
elementType: Cl Cl Cl P O O O O C C C C C C C C C C C C H H H H H H H H H H H H H H
charge: 0
multiplicity: 1
keywords: wb97x-d3
keywords: def2-TZVPP
keywords: def2/J RIJCOSX
keywords: DEFGRID2
keywords: scfconv7
keywords: smallprint printgap noloewdin
keywords: NOSOSCF
formula: C12H14Cl3O4P
InChI: InChI=1/C12H14Cl3O4P/c1-3-17-20(16,18-4-2)19-12(8-13)10-6-5-9(14)7-11(10)15/h5-8H,3-4H2,1-2H3
34 atoms
Cl 0.064752 -0.361349 2.306756
Cl -4.141248 2.58745 0.837918
Cl -1.033144 -3.34506 1.088379
P  2.093959 -0.145397 -1.390383
O  0.851993 -1.166551 -1.578834
O  1.462303 1.244467 -0.950318
O  2.734429 -0.67783 -0.049917
O  2.91151 -0.125444 -2.615995
C  -1.010447 -0.491217 -0.181303
C  -0.008271 -1.505729 -0.556488
C  0.860469 2.108384 -1.941511
C  4.052451 -0.295874 0.403975
C  -1.073218 0.078911 1.088097
C  -1.928162 -0.060349 -1.137214
C  0.146385 3.221659 -1.223639
C  4.090835 1.098183 0.980078
C  -2.036464 1.021728 1.41153
C  -2.895636 0.88281 -0.841263
C  -2.940107 1.41256 0.438767
C  0.071523 -2.739705 -0.076502
H  1.644471 2.500416 -2.59277
H  0.162193 1.537251 -2.559539
H  4.303481 -1.033866 1.163793
H  4.764917 -0.405976 -0.415835
H  -1.89546 -0.485865 -2.132098
H  -0.320583 3.878235 -1.95883
H  -0.639614 2.841546 -0.569882
H  0.835467 3.824116 -0.629492
H  3.956529 1.867921 0.220216
H  3.335474 1.233214 1.754638
H  5.068393 1.258243 1.437168
H  -2.073851 1.448087 2.404437
H  -3.603296 1.193364 -1.597454
H  0.822408 -3.44653 -0.405548
elementType: Cl P O C H
totalener: -2488.80055522 hartree
nucrepener: 2341.92666687 hartree
electener: -4830.72722209 hartree
oneelecener: -8087.48116459 hartree
twoeener: 3256.75394250 hartree
cpcmener: -0.02627786 hartree
kineticenergy: 2482.70608482 hartree
xcener: -152.812728779087 hartree
chargesum: 0.0000000
charge: -0.059575 -0.077863 -0.070332 0.895212 -0.337257 -0.323114 -0.315631 -0.615280 0.015991 0.102531 -0.001276 0.022927 0.030331 -0.118643 -0.245626 -0.238447 -0.116397 -0.180250 0.114529 -0.050997 0.125236 0.119967 0.106161 0.101940 0.154133 0.096265 0.074719 0.097769 0.085361 0.084311 0.099422 0.124364 0.144954 0.154563
qa: -0.0596 -0.0779 -0.0703 0.8952 -0.3373 -0.3231 -0.3156 -0.6153 0.0160 0.1025 -0.0013 0.0229 0.0303 -0.1186 -0.2456 -0.2384 -0.1164 -0.1802 0.1145 -0.0510 0.1252 0.1200 0.1062 0.1019 0.1541 0.0963 0.0747 0.0978 0.0854 0.0843 0.0994 0.1244 0.1450 0.1546
va: 1.2613 1.2245 1.2534 5.6283 2.0900 2.0596 2.1066 2.0143 3.5789 3.8075 3.8256 3.8646 3.9327 3.8550 3.9516 3.9125 4.0245 3.9923 3.8362 4.0809 1.0051 0.9864 0.9888 1.0023 1.0003 1.0080 1.0044 1.0053 1.0108 1.0093 1.0097 1.0215 1.0050 0.9989
dispcorr: -0.022032796 hartree
energy: -2488.822588015774
dipole: 20.55813 -20.79683 -0.23869 16.42893 -15.44281 0.98612 -9.99514 10.42372 0.42858
magnitude: 1.10141 au
magnitude: 2.79955 debye
