program: Orca
programVersion: 5.0.4
elementType: Cl Cl Cl P O O O O C C C C C C C C C C C C H H H H H H H H H H H H H H
charge: 0
multiplicity: 1
keywords: wb97x-d3
keywords: def2-TZVPP
keywords: def2/J RIJCOSX
keywords: DEFGRID2
keywords: scfconv7
keywords: smallprint printgap noloewdin
keywords: NOSOSCF
formula: C12H14Cl3O4P
InChI: InChI=1/C12H14Cl3O4P/c1-3-17-20(16,18-4-2)19-12(8-13)10-6-5-9(14)7-11(10)15/h5-8H,3-4H2,1-2H3
34 atoms
Cl -0.07962 0.110786 2.056374
Cl -5.242988 1.470832 1.648981
Cl -1.318012 -3.137646 -1.105185
P  2.289532 0.034271 -1.164301
O  0.694692 0.279812 -1.003704
O  2.840343 1.496243 -0.945843
O  2.588888 -0.828763 0.131756
O  2.733837 -0.528496 -2.451396
C  -1.492166 -0.171439 -0.23174
C  -0.268345 -0.686538 -0.874834
C  2.629893 2.28248 0.24666
C  3.742909 -1.689508 0.238322
C  -1.505812 0.251999 1.094486
C  -2.673904 -0.077758 -0.960635
C  3.772616 3.254631 0.373945
C  5.020392 -0.913138 0.437975
C  -2.651951 0.758249 1.684694
C  -3.83389 0.422333 -0.395982
C  -3.807912 0.838721 0.925055
C  -0.114114 -1.927798 -1.325109
H  1.676252 2.803772 0.150608
H  2.578259 1.637978 1.125299
H  3.535147 -2.322526 1.099418
H  3.802799 -2.332596 -0.641365
H  -2.684758 -0.394693 -1.995126
H  4.724635 2.736701 0.494178
H  3.839558 3.913494 -0.492248
H  3.615371 3.877031 1.255138
H  5.835068 -1.614429 0.622697
H  5.288397 -0.325675 -0.441262
H  4.954066 -0.247469 1.298906
H  -2.643395 1.077358 2.717917
H  -4.740072 0.488059 -0.982129
H  0.762042 -2.276336 -1.855514
elementType: Cl P O C H
totalener: -2488.80110143 hartree
nucrepener: 2256.74422801 hartree
electener: -4745.54532944 hartree
oneelecener: -7917.04226960 hartree
twoeener: 3171.49694016 hartree
cpcmener: -0.02490400 hartree
kineticenergy: 2482.69258348 hartree
xcener: -152.810915065058 hartree
chargesum: -0.0000000
charge: -0.066929 -0.076223 -0.079811 0.866293 -0.308838 -0.335821 -0.318579 -0.602820 0.006901 0.177614 0.029505 0.045437 0.028828 -0.142019 -0.240843 -0.255022 -0.142212 -0.145979 0.093856 -0.069498 0.114804 0.097907 0.103353 0.099776 0.160956 0.086158 0.091661 0.089488 0.104445 0.091814 0.088924 0.128317 0.147056 0.131504
qa: -0.0669 -0.0762 -0.0798 0.8663 -0.3088 -0.3358 -0.3186 -0.6028 0.0069 0.1776 0.0295 0.0454 0.0288 -0.1420 -0.2408 -0.2550 -0.1422 -0.1460 0.0939 -0.0695 0.1148 0.0979 0.1034 0.0998 0.1610 0.0862 0.0917 0.0895 0.1044 0.0918 0.0889 0.1283 0.1471 0.1315
va: 1.2590 1.2268 1.2290 5.6381 2.1268 2.1106 2.0619 2.0030 3.6255 3.8215 3.8321 3.8481 3.9589 3.9297 3.9673 3.9192 4.0537 3.9987 3.8889 4.0216 0.9936 0.9962 0.9909 1.0045 0.9979 1.0048 1.0034 1.0064 1.0105 1.0099 1.0024 1.0195 1.0037 1.0283
dispcorr: -0.019343589 hartree
energy: -2488.820445019668
dipole: 35.79639 -35.33979 0.45660 8.93130 -8.41874 0.51256 -0.41152 1.99875 1.58723
magnitude: 1.72930 au
magnitude: 4.39554 debye
