program: Orca
programVersion: 5.0.4
elementType: Cl Cl Cl P O O O O C C C C C C C C C C C C H H H H H H H H H H H H H H
charge: 0
multiplicity: 1
keywords: wb97x-d3
keywords: def2-TZVPP
keywords: def2/J RIJCOSX
keywords: DEFGRID2
keywords: scfconv7
keywords: smallprint printgap noloewdin
keywords: NOSOSCF
formula: C12H14Cl3O4P
InChI: InChI=1/C12H14Cl3O4P/c1-3-17-20(16,18-4-2)19-12(8-13)10-6-5-9(14)7-11(10)15/h5-8H,3-4H2,1-2H3
34 atoms
Cl 0.461541 -0.653634 2.442742
Cl -3.675617 2.631989 1.555177
Cl -1.820498 -3.584536 -0.384143
P  1.723245 0.016449 -1.485921
O  1.325238 -1.240002 -0.545906
O  1.336816 1.226804 -0.533618
O  3.296764 -0.089023 -1.524091
O  1.12229 0.015626 -2.830647
C  -0.926753 -0.632217 0.126106
C  0.017879 -1.641444 -0.38327
C  1.385471 2.595602 -0.993427
C  4.136408 -0.116261 -0.346522
C  -0.790146 -0.085056 1.399046
C  -1.943532 -0.153036 -0.691673
C  0.563063 3.436833 -0.053876
C  4.649451 -1.510282 -0.091529
C  -1.635964 0.90976 1.8560
C  -2.802998 0.843149 -0.261327
C  -2.633514 1.367696 1.009255
C  -0.268518 -2.90433 -0.669626
H  2.426941 2.922609 -1.006939
H  0.993863 2.659508 -2.010376
H  4.957047 0.568254 -0.55682
H  3.600252 0.27034 0.522395
H  -2.056759 -0.55668 -1.689155
H  -0.4877 3.146833 -0.074248
H  0.926549 3.368153 0.971943
H  0.627506 4.481024 -0.361732
H  3.849189 -2.200045 0.174447
H  5.179372 -1.905308 -0.958375
H  5.352728 -1.48016 0.741758
H  -1.515233 1.323776 2.847658
H  -3.583225 1.20878 -0.914248
H  0.467643 -3.592771 -1.064031
elementType: Cl P O C H
totalener: -2488.80152668 hartree
nucrepener: 2324.13424656 hartree
electener: -4812.93577323 hartree
oneelecener: -8052.06483589 hartree
twoeener: 3239.12906265 hartree
cpcmener: -0.02604416 hartree
kineticenergy: 2482.71966678 hartree
xcener: -152.813330598044 hartree
chargesum: -0.0000000
charge: -0.063254 -0.078477 -0.073668 0.894218 -0.306183 -0.316349 -0.356366 -0.604040 0.001880 0.079993 0.037172 0.052027 0.078917 -0.148596 -0.256852 -0.246798 -0.144965 -0.126723 0.087120 -0.053685 0.109049 0.104069 0.106139 0.094492 0.157786 0.082619 0.090809 0.103541 0.084213 0.089330 0.093786 0.126494 0.147299 0.155005
qa: -0.0633 -0.0785 -0.0737 0.8942 -0.3062 -0.3163 -0.3564 -0.6040 0.0019 0.0800 0.0372 0.0520 0.0789 -0.1486 -0.2569 -0.2468 -0.1450 -0.1267 0.0871 -0.0537 0.1090 0.1041 0.1061 0.0945 0.1578 0.0826 0.0908 0.1035 0.0842 0.0893 0.0938 0.1265 0.1473 0.1550
va: 1.2610 1.2212 1.2430 5.6334 2.0915 2.0691 2.1195 2.0108 3.5694 3.8702 3.8366 3.8428 3.8775 3.9622 3.9503 3.9415 4.0314 3.9699 3.8372 4.0734 0.9901 1.0019 0.9947 1.0032 1.0011 0.9992 1.0023 1.0103 1.0107 1.0041 1.0075 1.0208 1.0028 0.9986
dispcorr: -0.021639852 hartree
energy: -2488.823166526861
dipole: 24.63846 -23.53974 1.09872 12.23292 -11.13394 1.09898 -6.83064 7.97038 1.13974
magnitude: 1.92716 au
magnitude: 4.89846 debye
