program: Orca
programVersion: 5.0.4
elementType: Cl Cl Cl P O O O O C C C C C C C C C C C C H H H H H H H H H H H H H H
charge: 0
multiplicity: 1
keywords: wb97x-d3
keywords: def2-TZVPP
keywords: def2/J RIJCOSX
keywords: DEFGRID2
keywords: scfconv7
keywords: smallprint printgap noloewdin
keywords: NOSOSCF
formula: C12H14Cl3O4P
InChI: InChI=1/C12H14Cl3O4P/c1-3-17-20(16,18-4-2)19-12(8-13)10-6-5-9(14)7-11(10)15/h5-8H,3-4H2,1-2H3
34 atoms
Cl -1.186957 1.823859 1.914184
Cl -4.310965 0.540455 -2.235602
Cl -0.944704 -3.017082 2.430327
P  2.159552 0.415303 0.115338
O  1.270667 0.062351 1.41696
O  2.435175 -1.041529 -0.440166
O  1.178215 1.023044 -0.974536
O  3.28584 1.278026 0.513528
C  -0.924036 -0.498005 0.546782
C  0.221325 -0.826998 1.411375
C  3.221211 -1.276613 -1.630812
C  1.098207 2.442458 -1.232026
C  -1.613736 0.705868 0.669924
C  -1.309809 -1.373409 -0.463311
C  4.702001 -1.252692 -1.344636
C  2.042888 2.840841 -2.338511
C  -2.655223 1.036395 -0.17953
C  -2.350827 -1.0706 -1.322936
C  -3.012577 0.136726 -1.170752
C  0.325764 -1.88264 2.209533
H  2.909251 -2.259015 -1.981439
H  2.955776 -0.55241 -2.404624
H  0.062487 2.625296 -1.516404
H  1.295728 3.010941 -0.32173
H  -0.772724 -2.30402 -0.590877
H  4.969462 -1.963854 -0.562691
H  5.239841 -1.536017 -2.250475
H  5.048706 -0.262449 -1.050902
H  1.838683 2.286844 -3.255429
H  1.916382 3.902297 -2.555696
H  3.084267 2.680737 -2.058013
H  -3.179328 1.975528 -0.066781
H  -2.631266 -1.763987 -2.103624
H  1.214716 -2.073805 2.796788
elementType: Cl P O C H
totalener: -2488.80004870 hartree
nucrepener: 2309.05057091 hartree
electener: -4797.85061962 hartree
oneelecener: -8021.83495015 hartree
twoeener: 3223.98433053 hartree
cpcmener: -0.02560208 hartree
kineticenergy: 2482.71681326 hartree
xcener: -152.813816677687 hartree
chargesum: -0.0000000
charge: -0.063356 -0.075903 -0.072801 0.900304 -0.325211 -0.324467 -0.333378 -0.612513 0.075242 0.081014 0.038085 0.054172 0.012526 -0.159315 -0.243067 -0.253919 -0.124978 -0.142350 0.093982 -0.057170 0.106132 0.097838 0.100873 0.099007 0.157699 0.089445 0.094526 0.083790 0.088602 0.100351 0.086403 0.125953 0.147376 0.155108
qa: -0.0634 -0.0759 -0.0728 0.9003 -0.3252 -0.3245 -0.3334 -0.6125 0.0752 0.0810 0.0381 0.0542 0.0125 -0.1593 -0.2431 -0.2539 -0.1250 -0.1423 0.0940 -0.0572 0.1061 0.0978 0.1009 0.0990 0.1577 0.0894 0.0945 0.0838 0.0886 0.1004 0.0864 0.1260 0.1474 0.1551
va: 1.2594 1.2280 1.2458 5.6147 2.1107 2.0973 2.0564 1.9996 3.5250 3.8714 3.8666 3.8249 3.9169 3.9734 3.9264 3.9476 4.0222 4.0082 3.8780 4.0733 0.9919 0.9960 0.9899 1.0033 0.9991 1.0046 1.0080 1.0177 1.0020 1.0092 1.0147 1.0204 1.0031 0.9998
dispcorr: -0.020569399 hartree
energy: -2488.820618101622
dipole: 29.53362 -29.70196 -0.16834 4.00195 -4.64341 -0.64146 -19.97771 17.93412 -2.04359
magnitude: 2.14850 au
magnitude: 5.46105 debye
