program: Orca
programVersion: 5.0.4
elementType: Cl Cl Cl P O O O O C C C C C C C C C C C C H H H H H H H H H H H H H H
charge: 0
multiplicity: 1
keywords: wb97x-d3
keywords: def2-TZVPP
keywords: def2/J RIJCOSX
keywords: DEFGRID2
keywords: scfconv7
keywords: smallprint printgap noloewdin
keywords: NOSOSCF
formula: C12H14Cl3O4P
InChI: InChI=1/C12H14Cl3O4P/c1-3-17-20(16,18-4-2)19-12(8-13)10-6-5-9(14)7-11(10)15/h5-8H,3-4H2,1-2H3
34 atoms
Cl -1.284059 0.774686 2.450986
Cl -4.416598 1.113928 -1.867801
Cl -1.222552 -2.747858 2.591936
P  1.868018 0.343379 -0.382895
O  1.515824 -1.052376 0.363127
O  3.450535 0.302623 -0.364813
O  1.54461 -0.012129 -1.891245
O  1.214008 1.534979 0.187272
C  -0.904878 -0.750272 0.244394
C  0.280506 -1.346952 0.890307
C  4.21037 0.704579 0.798089
C  1.19402 1.006967 -2.853095
C  -1.672527 0.234361 0.86198
C  -1.256257 -1.148779 -1.042363
C  5.496634 1.335169 0.334575
C  2.374885 1.861642 -3.242502
C  -2.756436 0.811796 0.221444
C  -2.333009 -0.586362 -1.704045
C  -3.070861 0.393883 -1.060832
C  0.253634 -2.20447 1.902014
H  3.634866 1.40868 1.401954
H  4.400102 -0.183734 1.402011
H  0.815661 0.453983 -3.711112
H  0.376647 1.614368 -2.460836
H  -0.680071 -1.92055 -1.535297
H  6.087995 1.621132 1.204601
H  6.092735 0.643903 -0.261579
H  5.309895 2.2340 -0.253282
H  2.726608 2.480776 -2.416382
H  3.205785 1.257171 -3.606773
H  2.073329 2.533402 -4.047182
H  -3.339693 1.578178 0.712707
H  -2.589468 -0.911889 -2.70244
H  1.149513 -2.624402 2.340019
elementType: Cl P O C H
totalener: -2488.79933486 hartree
nucrepener: 2295.93964023 hartree
electener: -4784.73897508 hartree
oneelecener: -7996.50738790 hartree
twoeener: 3211.76841282 hartree
cpcmener: -0.02426596 hartree
kineticenergy: 2482.72279245 hartree
xcener: -152.815886160520 hartree
chargesum: 0.0000000
charge: -0.057363 -0.076576 -0.077952 0.936633 -0.318595 -0.351699 -0.350587 -0.595697 0.023206 0.121136 0.040823 0.048195 0.013302 -0.164138 -0.241534 -0.251476 -0.104738 -0.130935 0.079383 -0.069952 0.094770 0.104606 0.108431 0.098382 0.153949 0.090100 0.089620 0.086270 0.088019 0.092344 0.097828 0.124398 0.146430 0.153418
qa: -0.0574 -0.0766 -0.0780 0.9366 -0.3186 -0.3517 -0.3506 -0.5957 0.0232 0.1211 0.0408 0.0482 0.0133 -0.1641 -0.2415 -0.2515 -0.1047 -0.1309 0.0794 -0.0700 0.0948 0.1046 0.1084 0.0984 0.1539 0.0901 0.0896 0.0863 0.0880 0.0923 0.0978 0.1244 0.1464 0.1534
va: 1.2624 1.2269 1.2425 5.6137 2.1400 2.1240 2.0901 1.9785 3.5629 3.8569 3.8464 3.8311 3.9504 3.9226 3.9487 3.9400 4.0280 3.9604 3.8875 4.0267 1.0009 0.9943 0.9895 0.9989 1.0059 1.0077 1.0029 1.0054 1.0108 1.0048 1.0083 1.0199 1.0034 1.0000
dispcorr: -0.019825483 hartree
energy: -2488.819160339081
dipole: 35.48416 -34.04930 1.43486 10.26253 -10.51643 -0.25390 -17.09800 15.89409 -1.20390
magnitude: 1.89015 au
magnitude: 4.80437 debye
