program: Orca
programVersion: 5.0.4
elementType: Cl Cl Cl P O O O O C C C C C C C C C C C C H H H H H H H H H H H H H H
charge: 0
multiplicity: 1
keywords: wb97x-d3
keywords: def2-TZVPP
keywords: def2/J RIJCOSX
keywords: DEFGRID2
keywords: scfconv7
keywords: smallprint printgap noloewdin
keywords: NOSOSCF
formula: C12H14Cl3O4P
InChI: InChI=1/C12H14Cl3O4P/c1-3-17-20(16,18-4-2)19-12(8-13)10-6-5-9(14)7-11(10)15/h5-8H,3-4H2,1-2H3
34 atoms
Cl -1.158857 1.151408 2.34723
Cl -4.110357 0.996734 -2.124718
Cl -0.919158 -3.369354 1.864481
P  2.33209 0.221394 -0.007306
O  1.501314 -0.335573 1.263085
O  2.193343 -1.010775 -0.991996
O  1.421227 1.350253 -0.655087
O  3.680342 0.655385 0.396518
C  -0.743587 -0.64284 0.374726
C  0.396607 -1.150572 1.159465
C  2.93387 -1.129411 -2.227613
C  1.762966 2.751596 -0.584756
C  -1.497627 0.442272 0.810024
C  -1.06942 -1.222234 -0.846958
C  2.464741 -0.174103 -3.298108
C  1.551275 3.33897 0.787728
C  -2.538152 0.955704 0.054996
C  -2.105006 -0.731325 -1.622271
C  -2.823972 0.360636 -1.163629
C  0.432828 -2.310011 1.802699
H  3.998723 -1.003714 -2.022605
H  2.774847 -2.160191 -2.539578
H  2.791935 2.894568 -0.918261
H  1.109803 3.229296 -1.313286
H  -0.499415 -2.070226 -1.201957
H  2.949253 -0.445008 -4.237586
H  1.386709 -0.238607 -3.450346
H  2.728777 0.86171 -3.084849
H  0.5204 3.22708 1.120937
H  2.211815 2.895294 1.533807
H  1.773842 4.406418 0.747993
H  -3.114546 1.797892 0.412316
H  -2.340876 -1.192649 -2.571092
H  1.306217 -2.647763 2.345839
elementType: Cl P O C H
totalener: -2488.79852019 hartree
nucrepener: 2330.08427053 hartree
electener: -4818.88279073 hartree
oneelecener: -8064.05066770 hartree
twoeener: 3245.16787697 hartree
cpcmener: -0.02544621 hartree
kineticenergy: 2482.71040707 hartree
xcener: -152.813874223021 hartree
chargesum: 0.0000000
charge: -0.065675 -0.076342 -0.075218 0.894992 -0.316313 -0.323556 -0.334833 -0.610341 0.041702 0.090112 0.021604 0.042546 0.020351 -0.145541 -0.248076 -0.260007 -0.126496 -0.140275 0.095080 -0.056243 0.106936 0.107050 0.103761 0.108473 0.155633 0.103403 0.090253 0.086506 0.085909 0.090972 0.102843 0.128047 0.148085 0.154657
qa: -0.0657 -0.0763 -0.0752 0.8950 -0.3163 -0.3236 -0.3348 -0.6103 0.0417 0.0901 0.0216 0.0425 0.0204 -0.1455 -0.2481 -0.2600 -0.1265 -0.1403 0.0951 -0.0562 0.1069 0.1070 0.1038 0.1085 0.1556 0.1034 0.0903 0.0865 0.0859 0.0910 0.1028 0.1280 0.1481 0.1547
va: 1.2555 1.2266 1.2429 5.5955 2.0954 2.0944 2.0427 2.0112 3.5124 3.8711 3.8577 3.8170 3.9332 3.9377 3.9174 3.9284 4.0473 3.9918 3.8738 4.0794 1.0021 0.9896 1.0031 0.9919 1.0044 1.0094 1.0027 1.0068 1.0119 1.0148 1.0114 1.0188 1.0027 0.9996
dispcorr: -0.021514555 hartree
energy: -2488.820034747208
dipole: 22.94328 -23.22728 -0.28400 10.65356 -10.56609 0.08746 -17.07080 15.08283 -1.98797
magnitude: 2.01006 au
magnitude: 5.10917 debye
