program: Orca
programVersion: 5.0.4
elementType: Cl Cl Cl P O O O O C C C C C C C C C C C C H H H H H H H H H H H H H H
charge: 0
multiplicity: 1
keywords: wb97x-d3
keywords: def2-TZVPP
keywords: def2/J RIJCOSX
keywords: DEFGRID2
keywords: scfconv7
keywords: smallprint printgap noloewdin
keywords: NOSOSCF
formula: C12H14Cl3O4P
InChI: InChI=1/C12H14Cl3O4P/c1-3-17-20(16,18-4-2)19-12(8-13)10-6-5-9(14)7-11(10)15/h5-8H,3-4H2,1-2H3
34 atoms
Cl -1.894431 0.87461 2.778696
Cl -5.379606 0.702016 -1.266188
Cl -0.554929 -2.224949 2.387121
P  2.436648 0.104487 -0.514297
O  1.06664 0.623052 0.170384
O  1.868263 -0.79093 -1.701594
O  2.900701 1.433624 -1.242873
O  3.411878 -0.534814 0.38372
C  -1.215825 -0.008408 0.306263
C  0.166334 -0.227477 0.771272
C  2.588502 -1.939746 -2.173663
C  3.831008 2.327593 -0.610621
C  -2.22097 0.484071 1.134417
C  -1.5310 -0.255452 -1.028191
C  3.786122 -1.564035 -3.01604
C  5.261592 1.931109 -0.892343
C  -3.50512 0.701569 0.657512
C  -2.804292 -0.049702 -1.523202
C  -3.785362 0.428939 -0.669036
C  0.551821 -1.135568 1.661358
H  2.887148 -2.561931 -1.328094
H  1.863526 -2.50098 -2.762569
H  3.607418 3.30958 -1.025488
H  3.648229 2.377652 0.465351
H  -0.759811 -0.623579 -1.690867
H  4.227162 -2.46611 -3.441286
H  3.503824 -0.907008 -3.837804
H  4.556694 -1.070934 -2.423878
H  5.504177 0.97444 -0.43384
H  5.447818 1.867048 -1.96394
H  5.936754 2.68194 -0.481092
H  -4.271483 1.086179 1.314645
H  -3.031682 -0.256447 -2.559128
H  1.577521 -1.246609 1.98322
totalener: -2488.77923171 hartree
nucrepener: 2229.84445438 hartree
electener: -4718.62368609 hartree
oneelecener: -7863.15356204 hartree
twoeener: 3144.52987594 hartree
kineticenergy: 2482.76056819 hartree
xcener: -152.819656301528 hartree
chargesum: 0.0000000
charge: -0.043152 -0.064990 -0.057964 0.873678 -0.318289 -0.336345 -0.323595 -0.521133 0.044278 0.088302 0.041398 0.047616 0.010054 -0.121674 -0.241443 -0.264581 -0.126941 -0.147814 0.086487 -0.035657 0.099036 0.086403 0.094733 0.086465 0.132663 0.086104 0.090884 0.087397 0.102549 0.084125 0.089408 0.114282 0.121065 0.136652
qa: -0.0432 -0.0650 -0.0580 0.8737 -0.3183 -0.3363 -0.3236 -0.5211 0.0443 0.0883 0.0414 0.0476 0.0101 -0.1217 -0.2414 -0.2646 -0.1269 -0.1478 0.0865 -0.0357 0.0990 0.0864 0.0947 0.0865 0.1327 0.0861 0.0909 0.0874 0.1025 0.0841 0.0894 0.1143 0.1211 0.1367
va: 1.2801 1.2394 1.2612 5.6310 2.1556 2.1038 2.1183 2.0565 3.6351 3.8635 3.8824 3.8821 3.9996 3.9527 3.9227 3.9151 4.0382 4.0482 3.9296 4.0429 1.0041 0.9904 0.9928 1.0004 1.0154 1.0120 1.0053 1.0093 1.0140 1.0017 1.0139 1.0239 1.0147 1.0227
dispcorr: -0.018064431 hartree
energy: -2488.797296140291
dipole: 41.15052 -40.27999 0.87053 1.38833 -1.23410 0.15423 -21.89585 20.71848 -1.17737
magnitude: 1.47235 au
magnitude: 3.74241 debye
