program: Orca
programVersion: 5.0.4
elementType: Cl Cl Cl P O O O O C C C C C C C C C C C C H H H H H H H H H H H H H H
charge: 0
multiplicity: 1
keywords: wb97x-d3
keywords: def2-TZVPP
keywords: def2/J RIJCOSX
keywords: DEFGRID2
keywords: scfconv7
keywords: smallprint printgap noloewdin
keywords: NOSOSCF
formula: C12H14Cl3O4P
InChI: InChI=1/C12H14Cl3O4P/c1-3-17-20(16,18-4-2)19-12(8-13)10-6-5-9(14)7-11(10)15/h5-8H,3-4H2,1-2H3
34 atoms
Cl -0.657102 0.124561 2.948401
Cl -4.698667 2.092873 0.033892
Cl -0.897828 -3.492592 0.098141
P  2.246054 0.220864 -0.688302
O  1.4480 -0.36619 0.591462
O  3.034327 1.437147 -0.040809
O  3.372894 -0.890224 -0.846883
O  1.424425 0.520498 -1.871496
C  -0.940791 -0.371111 0.309815
C  0.3216 -1.128767 0.378659
C  2.491277 2.76579 -0.067017
C  4.149717 -0.969424 -2.050803
C  -1.459431 0.270989 1.430051
C  -1.612928 -0.231941 -0.898836
C  1.196238 2.908217 0.70367
C  3.539451 -1.942678 -3.032465
C  -2.616405 1.029396 1.35884
C  -2.77054 0.518566 -0.994954
C  -3.261383 1.145765 0.138674
C  0.44663 -2.44543 0.281073
H  3.26963 3.386907 0.374099
H  2.356542 3.081863 -1.103548
H  4.263708 0.017001 -2.507866
H  5.140563 -1.297396 -1.737034
H  -1.205724 -0.704336 -1.78129
H  0.367985 2.399661 0.210569
H  1.285992 2.522983 1.718586
H  0.935668 3.965247 0.765503
H  3.433086 -2.933247 -2.590631
H  2.560633 -1.60149 -3.366594
H  4.183016 -2.034829 -3.907866
H  -3.00688 1.517415 2.240288
H  -3.279897 0.623665 -1.941946
H  1.409728 -2.934935 0.330616
totalener: -2488.77942527 hartree
nucrepener: 2288.01435572 hartree
electener: -4776.79378099 hartree
oneelecener: -7979.63013268 hartree
twoeener: 3202.83635169 hartree
kineticenergy: 2482.76573699 hartree
xcener: -152.818031376556 hartree
chargesum: -0.0000000
charge: -0.050259 -0.064843 -0.054447 0.881145 -0.314342 -0.326924 -0.336333 -0.520830 -0.011061 0.120291 0.032350 0.032647 0.022098 -0.065107 -0.251721 -0.244716 -0.130166 -0.132365 0.084094 -0.062325 0.093920 0.094306 0.081424 0.093292 0.128396 0.086115 0.094359 0.090005 0.081146 0.097757 0.085375 0.113975 0.123876 0.128871
qa: -0.0503 -0.0648 -0.0544 0.8811 -0.3143 -0.3269 -0.3363 -0.5208 -0.0111 0.1203 0.0323 0.0326 0.0221 -0.0651 -0.2517 -0.2447 -0.1302 -0.1324 0.0841 -0.0623 0.0939 0.0943 0.0814 0.0933 0.1284 0.0861 0.0944 0.0900 0.0811 0.0978 0.0854 0.1140 0.1239 0.1289
va: 1.2721 1.2395 1.2638 5.6362 2.0999 2.1311 2.1266 2.0460 3.6577 3.8632 3.8922 3.9140 3.9569 3.9402 3.8996 3.9205 4.0474 4.0127 3.9360 4.1267 0.9899 0.9991 0.9997 0.9924 1.0178 1.0092 1.0119 1.0122 1.0046 1.0163 1.0119 1.0245 1.0113 1.0109
dispcorr: -0.020524563 hartree
energy: -2488.799949831241
dipole: 26.61932 -25.67307 0.94625 7.21871 -6.90064 0.31806 -16.26736 15.82258 -0.44478
magnitude: 1.09288 au
magnitude: 2.77788 debye
