program: Orca
programVersion: 5.0.4
elementType: Cl Cl Cl P O O O O C C C C C C C C C C C C H H H H H H H H H H H H H H
charge: 0
multiplicity: 1
keywords: wb97x-d3
keywords: def2-TZVPP
keywords: def2/J RIJCOSX
keywords: DEFGRID2
keywords: scfconv7
keywords: smallprint printgap noloewdin
keywords: NOSOSCF
formula: C12H14Cl3O4P
InChI: InChI=1/C12H14Cl3O4P/c1-3-17-20(16,18-4-2)19-12(8-13)10-6-5-9(14)7-11(10)15/h5-8H,3-4H2,1-2H3
34 atoms
Cl -1.488469 -0.921415 2.849717
Cl -4.808152 2.177397 0.031574
Cl -0.784183 -3.176911 0.237943
P  2.459725 0.356639 -0.674959
O  1.488348 0.026538 0.572727
O  3.299511 1.583504 -0.118826
O  3.49274 -0.84757 -0.584092
O  1.784508 0.568948 -1.965956
C  -0.911286 -0.069429 0.342232
C  0.380513 -0.782422 0.422503
C  2.896995 2.935151 -0.391803
C  4.413743 -1.092479 -1.660174
C  -1.826458 -0.069337 1.392387
C  -1.232815 0.653274 -0.805125
C  1.655331 3.347654 0.367323
C  3.824599 -2.008688 -2.707911
C  -3.027499 0.618335 1.304181
C  -2.4247 1.345985 -0.912367
C  -3.316025 1.321057 0.147806
C  0.537306 -2.099149 0.39012
H  3.749624 3.54233 -0.090631
H  2.754761 3.06456 -1.466658
H  4.739808 -0.150487 -2.109298
H  5.286845 -1.545122 -1.191053
H  -0.535226 0.663858 -1.631607
H  1.48844 4.415884 0.225428
H  0.76408 2.829313 0.01433
H  1.761106 3.162072 1.435177
H  4.578379 -2.225491 -3.465558
H  3.508742 -2.95613 -2.272317
H  2.970138 -1.549852 -3.202138
H  -3.723834 0.605653 2.130265
H  -2.659578 1.894376 -1.813464
H  1.507748 -2.569275 0.468834
totalener: -2488.78019301 hartree
nucrepener: 2260.64767503 hartree
electener: -4749.42786804 hartree
oneelecener: -7924.83735853 hartree
twoeener: 3175.40949049 hartree
kineticenergy: 2482.75125056 hartree
xcener: -152.817877928607 hartree
chargesum: -0.0000000
charge: -0.045553 -0.064893 -0.051355 0.887454 -0.314968 -0.328956 -0.341238 -0.528868 0.018975 0.134636 0.024393 0.030126 0.032162 -0.175096 -0.234782 -0.242094 -0.139769 -0.133734 0.088110 -0.054639 0.094348 0.094489 0.081795 0.095103 0.177479 0.086664 0.083529 0.093100 0.084880 0.080421 0.102040 0.113811 0.126178 0.126252
qa: -0.0456 -0.0649 -0.0514 0.8875 -0.3150 -0.3290 -0.3412 -0.5289 0.0190 0.1346 0.0244 0.0301 0.0322 -0.1751 -0.2348 -0.2421 -0.1398 -0.1337 0.0881 -0.0546 0.0943 0.0945 0.0818 0.0951 0.1775 0.0867 0.0835 0.0931 0.0849 0.0804 0.1020 0.1138 0.1262 0.1263
va: 1.2777 1.2399 1.2691 5.6203 2.1195 2.1320 2.1255 2.0307 3.6351 3.8360 3.8925 3.9103 4.0033 3.8591 3.9103 3.9193 4.0526 4.0229 3.9292 4.1093 0.9901 1.0025 1.0003 0.9919 1.0168 1.0116 1.0067 1.0084 1.0113 1.0049 1.0168 1.0241 1.0125 1.0139
dispcorr: -0.019105387 hartree
energy: -2488.799298395009
dipole: 31.46928 -30.25455 1.21473 10.37002 -9.87490 0.49513 -16.18919 15.82766 -0.36153
magnitude: 1.36067 au
magnitude: 3.45855 debye
