program: Orca
programVersion: 5.0.4
elementType: Cl Cl Cl P O O O O C C C C C C C C C C C C H H H H H H H H H H H H H H
charge: 0
multiplicity: 1
keywords: wb97x-d3
keywords: def2-TZVPP
keywords: def2/J RIJCOSX
keywords: DEFGRID2
keywords: scfconv7
keywords: smallprint printgap noloewdin
keywords: NOSOSCF
formula: C12H14Cl3O4P
InChI: InChI=1/C12H14Cl3O4P/c1-3-17-20(16,18-4-2)19-12(8-13)10-6-5-9(14)7-11(10)15/h5-8H,3-4H2,1-2H3
34 atoms
Cl -2.05052 2.177412 1.14942
Cl -4.879405 -2.029698 -0.534214
Cl 0.157996 0.516608 3.113289
P  2.665939 0.222097 -0.941739
O  1.137377 0.712296 -0.714283
O  2.508975 -1.360091 -0.871112
O  2.815709 0.488007 -2.496203
O  3.681506 0.822645 -0.062809
C  -0.881066 -0.093251 0.236214
C  0.449094 0.504246 0.457494
C  3.481291 -2.178808 -0.200972
C  3.34724 1.724261 -2.994422
C  -2.069073 0.573884 0.524494
C  -0.967371 -1.364009 -0.329006
C  3.166088 -2.317281 1.269751
C  2.321913 2.83548 -2.987442
C  -3.302161 -0.017792 0.29243
C  -2.184669 -1.971952 -0.568061
C  -3.348409 -1.290251 -0.247575
C  0.975924 0.816033 1.637628
H  3.436362 -3.143749 -0.705016
H  4.485167 -1.775113 -0.344611
H  4.232254 2.00564 -2.419933
H  3.666256 1.501952 -4.011928
H  -0.056294 -1.889456 -0.581405
H  3.262116 -1.363639 1.786523
H  2.156727 -2.696516 1.42807
H  3.863766 -3.018137 1.729062
H  1.418152 2.544699 -3.521075
H  2.043121 3.128921 -1.975923
H  2.739088 3.713512 -3.481264
H  -4.212726 0.515326 0.524708
H  -2.229932 -2.962189 -0.998156
H  1.950665 1.271582 1.74203
totalener: -2488.77937428 hartree
nucrepener: 2257.58137626 hartree
electener: -4746.36075054 hartree
oneelecener: -7918.55717612 hartree
twoeener: 3172.19642557 hartree
kineticenergy: 2482.75375817 hartree
xcener: -152.819082179269 hartree
chargesum: -0.0000000
charge: -0.042891 -0.063840 -0.058809 0.873879 -0.315302 -0.337090 -0.327949 -0.519671 0.074843 0.108310 0.036381 0.015236 -0.008082 -0.128396 -0.249841 -0.230948 -0.122973 -0.154697 0.085348 -0.058495 0.096652 0.095279 0.095886 0.093282 0.128700 0.098278 0.084284 0.093947 0.089283 0.086327 0.084246 0.114348 0.121822 0.142652
qa: -0.0429 -0.0638 -0.0588 0.8739 -0.3153 -0.3371 -0.3279 -0.5197 0.0748 0.1083 0.0364 0.0152 -0.0081 -0.1284 -0.2498 -0.2309 -0.1230 -0.1547 0.0853 -0.0585 0.0967 0.0953 0.0959 0.0933 0.1287 0.0983 0.0843 0.0939 0.0893 0.0863 0.0842 0.1143 0.1218 0.1427
va: 1.2807 1.2405 1.2576 5.6326 2.1264 2.0947 2.1479 2.0610 3.5847 3.8151 3.8605 3.9088 4.0120 3.9493 3.9135 3.9078 4.0313 4.0718 3.9328 4.0250 0.9931 1.0056 1.0036 0.9892 1.0214 1.0116 1.0051 1.0140 1.0063 1.0147 1.0106 1.0236 1.0147 1.0206
dispcorr: -0.018991813 hartree
energy: -2488.798366097414
dipole: 30.95429 -30.32626 0.62804 -3.23930 2.70425 -0.53504 -14.17315 13.38146 -0.79170
magnitude: 1.14345 au
magnitude: 2.90643 debye
