program: Orca
programVersion: 5.0.4
elementType: Cl Cl Cl P O O O O C C C C C C C C C C C C H H H H H H H H H H H H H H
charge: 0
multiplicity: 1
keywords: wb97x-d3
keywords: def2-TZVPP
keywords: def2/J RIJCOSX
keywords: DEFGRID2
keywords: scfconv7
keywords: smallprint printgap noloewdin
keywords: NOSOSCF
formula: C12H14Cl3O4P
InChI: InChI=1/C12H14Cl3O4P/c1-3-17-20(16,18-4-2)19-12(8-13)10-6-5-9(14)7-11(10)15/h5-8H,3-4H2,1-2H3
34 atoms
Cl -0.362056 -0.139343 2.773833
Cl -4.709468 2.039674 0.536229
Cl -1.083098 -3.460485 0.198995
P  1.829168 0.463058 -1.313153
O  1.493806 -0.507769 -0.040873
O  1.626015 1.930145 -0.764067
O  3.412922 0.319655 -1.394101
O  1.072131 0.139397 -2.527755
C  -0.932373 -0.378195 0.144801
C  0.299348 -1.183248 0.019208
C  1.785244 2.369612 0.589803
C  4.024452 -0.579362 -2.328876
C  -1.326182 0.146795 1.371362
C  -1.733959 -0.130608 -0.964595
C  3.20825 2.293475 1.096381
C  3.764232 -2.037725 -2.019704
C  -2.484608 0.892724 1.504444
C  -2.895639 0.613278 -0.857435
C  -3.261727 1.117021 0.380172
C  0.330142 -2.508641 0.014686
H  1.440325 3.402517 0.581226
H  1.116157 1.805862 1.241718
H  3.690776 -0.337662 -3.339699
H  5.089633 -0.359847 -2.266455
H  -1.431092 -0.520231 -1.925908
H  3.255196 2.763773 2.079202
H  3.553095 1.266618 1.207774
H  3.89721 2.820158 0.437332
H  4.36864 -2.659067 -2.681327
H  4.034067 -2.281789 -0.992335
H  2.720678 -2.305822 -2.18611
H  -2.778338 1.284208 2.467642
H  -3.508441 0.800168 -1.727531
H  1.253272 -3.064465 -0.076442
totalener: -2488.77646722 hartree
nucrepener: 2302.64082275 hartree
electener: -4791.41728997 hartree
oneelecener: -8008.63602214 hartree
twoeener: 3217.21873217 hartree
kineticenergy: 2482.75511846 hartree
xcener: -152.819322937766 hartree
chargesum: 0.0000000
charge: -0.058192 -0.063124 -0.056614 0.857305 -0.325349 -0.315117 -0.317648 -0.506438 -0.052947 0.145329 0.026071 0.026447 0.052538 -0.049544 -0.236815 -0.260364 -0.148767 -0.151142 0.104118 -0.068118 0.097863 0.076072 0.097446 0.091877 0.139520 0.087478 0.084454 0.092970 0.091061 0.091420 0.088139 0.114757 0.126060 0.119254
qa: -0.0582 -0.0631 -0.0566 0.8573 -0.3253 -0.3151 -0.3176 -0.5064 -0.0529 0.1453 0.0261 0.0264 0.0525 -0.0495 -0.2368 -0.2604 -0.1488 -0.1511 0.1041 -0.0681 0.0979 0.0761 0.0974 0.0919 0.1395 0.0875 0.0845 0.0930 0.0911 0.0914 0.0881 0.1148 0.1261 0.1193
va: 1.2639 1.2413 1.2625 5.5926 2.0280 2.1399 2.1100 2.0945 3.6657 3.8372 3.9055 3.8969 3.9252 3.9340 3.9170 3.8984 4.0779 4.0350 3.9259 4.1092 0.9912 1.0117 1.0008 0.9902 1.0205 1.0099 1.0164 1.0078 1.0138 1.0026 1.0130 1.0245 1.0111 1.0075
dispcorr: -0.020965923 hartree
energy: -2488.797433141493
dipole: 31.87269 -30.72285 1.14983 4.18036 -4.11458 0.06578 -10.07338 10.42686 0.35348
magnitude: 1.20474 au
magnitude: 3.06220 debye
