program: Orca
programVersion: 5.0.4
elementType: Cl Cl Cl P O O O O C C C C C C C C C C C C H H H H H H H H H H H H H H
charge: 0
multiplicity: 1
keywords: wb97x-d3
keywords: def2-TZVPP
keywords: def2/J RIJCOSX
keywords: DEFGRID2
keywords: scfconv7
keywords: smallprint printgap noloewdin
keywords: NOSOSCF
formula: C12H14Cl3O4P
InChI: InChI=1/C12H14Cl3O4P/c1-3-17-20(16,18-4-2)19-12(8-13)10-6-5-9(14)7-11(10)15/h5-8H,3-4H2,1-2H3
34 atoms
Cl 0.025379 -0.272192 2.78329
Cl -4.141987 2.479778 0.856631
Cl -1.439115 -3.539257 -0.109367
P  1.973194 0.247579 -0.916227
O  1.542185 -0.991036 0.037778
O  1.758446 1.468744 0.070686
O  3.554567 0.085609 -0.926108
O  1.309926 0.289784 -2.228481
C  -0.833196 -0.507295 0.235969
C  0.258879 -1.473447 0.014529
C  1.639544 2.809608 -0.424824
C  4.21131 -0.627371 -1.981672
C  -1.014705 0.11258 1.468537
C  -1.698292 -0.180175 -0.801975
C  0.192994 3.178413 -0.654908
C  3.89254 -2.107172 -1.997873
C  -2.035762 1.02632 1.67143
C  -2.722364 0.732292 -0.624337
C  -2.879451 1.329675 0.61586
C  0.095597 -2.777183 -0.17119
H  2.089327 3.441253 0.340785
H  2.22292 2.940142 -1.340023
H  3.960362 -0.17304 -2.94237
H  5.27394 -0.468361 -1.803082
H  -1.552311 -0.642805 -1.767978
H  -0.395151 3.045132 0.252473
H  0.123499 4.225601 -0.95025
H  -0.247871 2.572815 -1.44506
H  4.080806 -2.56685 -1.028259
H  2.857304 -2.295833 -2.282309
H  4.526632 -2.601851 -2.734154
H  -2.169735 1.491376 2.637508
H  -3.385053 0.981427 -1.440564
H  0.932615 -3.439361 -0.345254
totalener: -2488.77882919 hartree
nucrepener: 2326.57714050 hartree
electener: -4815.35596970 hartree
oneelecener: -8056.72326265 hartree
twoeener: 3241.36729296 hartree
kineticenergy: 2482.78046497 hartree
xcener: -152.822800880769 hartree
chargesum: 0.0000000
charge: -0.042088 -0.064001 -0.058378 0.876746 -0.305982 -0.317835 -0.334523 -0.513764 -0.006872 0.109861 0.035409 0.028258 0.084091 -0.094172 -0.267870 -0.257693 -0.172828 -0.148484 0.102659 -0.069242 0.094677 0.085442 0.094368 0.092438 0.134479 0.090045 0.094974 0.100948 0.094575 0.086521 0.089653 0.113977 0.125053 0.119560
qa: -0.0421 -0.0640 -0.0584 0.8767 -0.3060 -0.3178 -0.3345 -0.5138 -0.0069 0.1099 0.0354 0.0283 0.0841 -0.0942 -0.2679 -0.2577 -0.1728 -0.1485 0.1027 -0.0692 0.0947 0.0854 0.0944 0.0924 0.1345 0.0900 0.0950 0.1009 0.0946 0.0865 0.0897 0.1140 0.1251 0.1196
va: 1.2820 1.2387 1.2600 5.6321 2.1179 2.1214 2.1384 2.0531 3.6346 3.8792 3.9034 3.9008 3.9281 3.9278 3.9199 3.9010 4.0377 3.9927 3.8765 4.0858 0.9925 0.9995 1.0006 0.9901 1.0144 0.9978 1.0153 1.0096 1.0044 1.0139 1.0121 1.0269 1.0113 1.0087
dispcorr: -0.022032575 hartree
energy: -2488.800861765838
dipole: 22.94143 -22.10630 0.83513 7.71178 -7.35499 0.35679 -17.92451 17.48031 -0.44420
magnitude: 1.01096 au
magnitude: 2.56967 debye
