program: Orca
programVersion: 5.0.4
elementType: Cl Cl Cl P O O O O C C C C C C C C C C C C H H H H H H H H H H H H H H
charge: 0
multiplicity: 1
keywords: wb97x-d3
keywords: def2-TZVPP
keywords: def2/J RIJCOSX
keywords: DEFGRID2
keywords: scfconv7
keywords: smallprint printgap noloewdin
keywords: NOSOSCF
formula: C12H14Cl3O4P
InChI: InChI=1/C12H14Cl3O4P/c1-3-17-20(16,18-4-2)19-12(8-13)10-6-5-9(14)7-11(10)15/h5-8H,3-4H2,1-2H3
34 atoms
Cl -1.143444 1.914094 1.768232
Cl -4.317914 0.405317 -2.263872
Cl -0.929321 -2.860168 2.535601
P  2.212239 0.409507 0.015415
O  1.335406 0.113472 1.339349
O  2.400682 -1.070525 -0.535351
O  1.208591 1.022039 -1.063349
O  3.387283 1.227548 0.32987
C  -0.876216 -0.465884 0.51122
C  0.274512 -0.75297 1.385807
C  3.213354 -1.328628 -1.688524
C  1.031286 2.441625 -1.183464
C  -1.57782 0.733934 0.589919
C  -1.273069 -1.391473 -0.447335
C  4.679532 -1.436977 -1.335145
C  1.987837 3.029416 -2.195386
C  -2.637845 1.009992 -0.256818
C  -2.329654 -1.140525 -1.303369
C  -3.00293 0.065709 -1.201766
C  0.353897 -1.759266 2.248821
H  2.841783 -2.268288 -2.096524
H  3.049605 -0.560219 -2.449349
H  -0.003969 2.575706 -1.497473
H  1.146235 2.93159 -0.214258
H  -0.730386 -2.323343 -0.528141
H  4.846659 -2.207031 -0.582843
H  5.248023 -1.709409 -2.225046
H  5.071286 -0.494617 -0.95669
H  1.882441 2.54403 -3.165727
H  1.77483 4.090536 -2.328768
H  3.01984 2.933353 -1.861932
H  -3.175319 1.943806 -0.173561
H  -2.622583 -1.870267 -2.044463
H  1.239279 -1.920255 2.848141
totalener: -2488.77728720 hartree
nucrepener: 2312.91882866 hartree
electener: -4801.69611585 hartree
oneelecener: -8029.01755015 hartree
twoeener: 3227.32143429 hartree
kineticenergy: 2482.76987972 hartree
xcener: -152.820324224967 hartree
chargesum: 0.0000000
charge: -0.047702 -0.061846 -0.057451 0.842584 -0.301101 -0.310109 -0.321639 -0.508799 0.083248 0.099948 0.022666 0.034671 -0.006807 -0.126650 -0.229306 -0.256716 -0.135966 -0.127061 0.086655 -0.069103 0.089559 0.080846 0.090008 0.097710 0.134797 0.082937 0.078969 0.098934 0.080239 0.086327 0.101255 0.117184 0.123615 0.128105
qa: -0.0477 -0.0618 -0.0575 0.8426 -0.3011 -0.3101 -0.3216 -0.5088 0.0832 0.0999 0.0227 0.0347 -0.0068 -0.1267 -0.2293 -0.2567 -0.1360 -0.1271 0.0867 -0.0691 0.0896 0.0808 0.0900 0.0977 0.1348 0.0829 0.0790 0.0989 0.0802 0.0863 0.1013 0.1172 0.1236 0.1281
va: 1.2780 1.2441 1.2625 5.6433 2.1295 2.0987 2.0505 2.1163 3.5931 3.8762 3.9187 3.8709 3.9480 3.9939 3.9169 3.9589 4.0156 4.0210 3.9380 4.0915 0.9920 0.9978 0.9852 0.9993 1.0061 1.0061 1.0103 1.0203 1.0028 1.0116 1.0170 1.0239 1.0113 1.0095
dispcorr: -0.020710231 hartree
energy: -2488.797997427478
dipole: 28.91935 -28.98795 -0.06860 3.68144 -4.10721 -0.42577 -18.91209 17.65484 -1.25725
magnitude: 1.32916 au
magnitude: 3.37845 debye
