program: Orca
programVersion: 5.0.4
elementType: Cl Cl Cl P O O O O C C C C C C C C C C C C H H H H H H H H H H H H H H
charge: 0
multiplicity: 1
keywords: wb97x-d3
keywords: def2-TZVPP
keywords: def2/J RIJCOSX
keywords: DEFGRID2
keywords: scfconv7
keywords: smallprint printgap noloewdin
keywords: NOSOSCF
formula: C12H14Cl3O4P
InChI: InChI=1/C12H14Cl3O4P/c1-3-17-20(16,18-4-2)19-12(8-13)10-6-5-9(14)7-11(10)15/h5-8H,3-4H2,1-2H3
34 atoms
Cl 0.000178 0.000935 2.835977
Cl -4.148862 2.515225 0.568962
Cl -1.529867 -3.603215 0.426534
P  1.907168 0.049302 -0.852148
O  1.491059 -1.105458 0.206607
O  1.694544 1.356271 0.017494
O  3.489276 -0.100671 -0.857905
O  1.227526 -0.035187 -2.153915
C  -0.878076 -0.566943 0.349879
C  0.200453 -1.568692 0.256885
C  1.618436 2.645087 -0.609556
C  4.121737 -1.015767 -1.764521
C  -1.047011 0.214404 1.488639
C  -1.740862 -0.369166 -0.722128
C  0.191961 3.008814 -0.948097
C  4.470907 -0.343643 -3.072596
C  -2.056449 1.159719 1.569896
C  -2.752174 0.571939 -0.666296
C  -2.899569 1.329422 0.484247
C  0.016216 -2.882675 0.250349
H  2.040562 3.341987 0.113837
H  2.249685 2.680705 -1.501714
H  5.017867 -1.361127 -1.249674
H  3.489629 -1.890648 -1.939465
H  -1.602825 -0.95756 -1.618164
H  0.155784 4.027793 -1.334381
H  -0.217106 2.343148 -1.706153
H  -0.44517 2.961747 -0.06583
H  3.574394 -0.039063 -3.609933
H  5.098109 0.532348 -2.90879
H  5.025011 -1.037227 -3.7057
H  -2.180532 1.752353 2.464889
H  -3.413787 0.719549 -1.507591
H  0.840991 -3.576496 0.162793
totalener: -2488.77900763 hartree
nucrepener: 2319.62456077 hartree
electener: -4808.40356840 hartree
oneelecener: -8042.85127917 hartree
twoeener: 3234.44771077 hartree
kineticenergy: 2482.78432117 hartree
xcener: -152.822891834869 hartree
chargesum: -0.0000000
charge: -0.041873 -0.064633 -0.058093 0.881177 -0.309067 -0.312161 -0.333891 -0.515970 -0.009411 0.112827 0.038091 0.039776 0.076080 -0.088317 -0.265518 -0.251297 -0.167477 -0.143760 0.096157 -0.076448 0.095204 0.084128 0.093874 0.078747 0.132662 0.094786 0.100241 0.090507 0.099288 0.082964 0.083347 0.114176 0.124646 0.119237
qa: -0.0419 -0.0646 -0.0581 0.8812 -0.3091 -0.3122 -0.3339 -0.5160 -0.0094 0.1128 0.0381 0.0398 0.0761 -0.0883 -0.2655 -0.2513 -0.1675 -0.1438 0.0962 -0.0764 0.0952 0.0841 0.0939 0.0787 0.1327 0.0948 0.1002 0.0905 0.0993 0.0830 0.0833 0.1142 0.1246 0.1192
va: 1.2828 1.2383 1.2597 5.6445 2.1327 2.1192 2.1334 2.0511 3.6407 3.8826 3.9020 3.9133 3.9315 3.9365 3.9174 3.9172 4.0284 3.9920 3.8800 4.0928 0.9928 0.9987 0.9918 1.0003 1.0149 1.0155 1.0118 0.9978 1.0176 1.0039 1.0118 1.0270 1.0115 1.0105
dispcorr: -0.021576928 hartree
energy: -2488.800584561582
dipole: 24.57060 -23.70914 0.86146 10.31290 -9.95850 0.35440 -21.82048 21.30028 -0.52020
magnitude: 1.06692 au
magnitude: 2.71190 debye
