program: Orca
programVersion: 5.0.4
elementType: Cl Cl Cl P O O O O C C C C C C C C C C C C H H H H H H H H H H H H H H
charge: 0
multiplicity: 1
keywords: wb97x-d3
keywords: def2-TZVPP
keywords: def2/J RIJCOSX
keywords: DEFGRID2
keywords: scfconv7
keywords: smallprint printgap noloewdin
keywords: NOSOSCF
formula: C12H14Cl3O4P
InChI: InChI=1/C12H14Cl3O4P/c1-3-17-20(16,18-4-2)19-12(8-13)10-6-5-9(14)7-11(10)15/h5-8H,3-4H2,1-2H3
34 atoms
Cl 0.245043 -0.256147 2.578365
Cl -4.121735 2.471392 1.12145
Cl -1.618629 -3.531643 -0.302849
P  1.896735 0.094391 -1.241432
O  1.436708 -1.067299 -0.205962
O  1.590843 1.39669 -0.368063
O  3.470948 -0.088526 -1.226358
O  1.302701 0.043019 -2.579441
C  -0.904945 -0.524759 0.149506
C  0.13829 -1.511267 -0.179882
C  1.438571 2.674479 -1.004946
C  4.271036 -0.084719 -0.036739
C  -0.936935 0.117898 1.383725
C  -1.885261 -0.206879 -0.783936
C  -0.002342 2.939551 -1.370627
C  4.689179 -1.487035 0.341133
C  -1.922443 1.040616 1.691011
C  -2.881295 0.710059 -0.499663
C  -2.890437 1.325662 0.741621
C  -0.073822 -2.79851 -0.424077
H  1.797621 3.403739 -0.278837
H  2.079814 2.748029 -1.887232
H  5.144301 0.526575 -0.266834
H  3.744811 0.398659 0.789805
H  -1.856822 -0.685304 -1.753422
H  -0.651155 2.853868 -0.499373
H  -0.099135 3.951482 -1.765621
H  -0.348141 2.243885 -2.132879
H  3.834941 -2.097618 0.628111
H  5.208094 -1.978723 -0.480905
H  5.371632 -1.445511 1.190641
H  -1.938674 1.522818 2.657824
H  -3.636138 0.948005 -1.235272
H  0.732898 -3.467804 -0.689293
totalener: -2488.77765279 hartree
nucrepener: 2325.02622615 hartree
electener: -4813.80387893 hartree
oneelecener: -8053.38430172 hartree
twoeener: 3239.58042278 hartree
kineticenergy: 2482.76840103 hartree
xcener: -152.820311670740 hartree
chargesum: -0.0000000
charge: -0.051785 -0.062923 -0.055930 0.845107 -0.310000 -0.322082 -0.325973 -0.495342 0.001627 0.114618 0.027270 0.034674 0.081473 -0.133510 -0.250866 -0.239299 -0.141115 -0.124518 0.077373 -0.073358 0.091376 0.095000 0.093443 0.086678 0.143685 0.082873 0.094976 0.099365 0.086785 0.088202 0.081529 0.113160 0.125072 0.122413
qa: -0.0518 -0.0629 -0.0559 0.8451 -0.3100 -0.3221 -0.3260 -0.4953 0.0016 0.1146 0.0273 0.0347 0.0815 -0.1335 -0.2509 -0.2393 -0.1411 -0.1245 0.0774 -0.0734 0.0914 0.0950 0.0934 0.0867 0.1437 0.0829 0.0950 0.0994 0.0868 0.0882 0.0815 0.1132 0.1251 0.1224
va: 1.2722 1.2394 1.2630 5.6487 2.0903 2.0536 2.1394 2.1218 3.6383 3.8696 3.8956 3.8837 3.9230 3.9307 3.9180 3.9379 4.0483 3.9758 3.9022 4.1151 0.9922 0.9980 0.9924 1.0036 1.0072 0.9992 1.0152 1.0139 1.0117 1.0045 1.0108 1.0263 1.0115 1.0091
dispcorr: -0.021821489 hartree
energy: -2488.799474275170
dipole: 24.05720 -23.30534 0.75186 10.14573 -9.48053 0.66520 -9.02766 9.65025 0.62258
magnitude: 1.18127 au
magnitude: 3.00255 debye
