program: Orca
programVersion: 5.0.4
elementType: Cl Cl Cl P O O O O C C C C C C C C C C C C H H H H H H H H H H H H H H
charge: 0
multiplicity: 1
keywords: wb97x-d3
keywords: def2-TZVPP
keywords: def2/J RIJCOSX
keywords: DEFGRID2
keywords: scfconv7
keywords: smallprint printgap noloewdin
keywords: NOSOSCF
formula: C12H14Cl3O4P
InChI: InChI=1/C12H14Cl3O4P/c1-3-17-20(16,18-4-2)19-12(8-13)10-6-5-9(14)7-11(10)15/h5-8H,3-4H2,1-2H3
34 atoms
Cl -1.251848 1.248869 2.245815
Cl -4.232696 0.747062 -2.172847
Cl -0.884022 -3.30632 1.918556
P  2.311857 0.290516 -0.00891
O  1.457044 -0.225818 1.261322
O  2.192985 -0.982944 -0.958726
O  1.377198 1.372995 -0.716773
O  3.652469 0.756413 0.358046
C  -0.772172 -0.624136 0.362704
C  0.378861 -1.068824 1.170792
C  3.055672 -1.170479 -2.085864
C  1.699118 2.770935 -0.673888
C  -1.566452 0.448836 0.75263
C  -1.084631 -1.272183 -0.826664
C  2.701968 -0.278502 -3.256553
C  1.521206 3.381422 0.697334
C  -2.632078 0.879533 -0.019544
C  -2.145875 -0.864651 -1.614159
C  -2.908655 0.216631 -1.203487
C  0.433474 -2.209906 1.845354
H  4.094348 -1.022762 -1.782158
H  2.93675 -2.218856 -2.357857
H  2.72031 2.923527 -1.029424
H  1.021506 3.231552 -1.391802
H  -0.478006 -2.110694 -1.138866
H  1.64726 -0.3626 -3.51581
H  2.922779 0.769723 -3.059179
H  3.288587 -0.577803 -4.125563
H  1.716936 4.452601 0.639257
H  0.50807 3.242867 1.070096
H  2.220322 2.959384 1.418259
H  -3.240699 1.712126 0.302667
H  -2.376925 -1.378503 -2.536226
H  1.307239 -2.498865 2.412937
totalener: -2488.77609748 hartree
nucrepener: 2326.09955982 hartree
electener: -4814.87565730 hartree
oneelecener: -8055.48420390 hartree
twoeener: 3240.60854660 hartree
kineticenergy: 2482.76641932 hartree
xcener: -152.820779449754 hartree
chargesum: -0.0000000
charge: -0.052648 -0.064022 -0.059111 0.830233 -0.295874 -0.313306 -0.319995 -0.502741 0.041897 0.104013 -0.003575 0.023531 0.025574 -0.105512 -0.226784 -0.251712 -0.138228 -0.133546 0.089450 -0.065840 0.105767 0.092663 0.096972 0.096531 0.130050 0.086996 0.079489 0.090310 0.086176 0.085032 0.101676 0.114362 0.123525 0.128646
qa: -0.0526 -0.0640 -0.0591 0.8302 -0.2959 -0.3133 -0.3200 -0.5027 0.0419 0.1040 -0.0036 0.0235 0.0256 -0.1055 -0.2268 -0.2517 -0.1382 -0.1335 0.0894 -0.0658 0.1058 0.0927 0.0970 0.0965 0.1300 0.0870 0.0795 0.0903 0.0862 0.0850 0.1017 0.1144 0.1235 0.1286
va: 1.2695 1.2405 1.2605 5.6296 2.1146 2.0865 2.0432 2.1275 3.5914 3.8768 3.9086 3.8676 3.9561 3.9555 3.9112 3.9154 4.0635 4.0162 3.9347 4.0974 1.0030 0.9898 1.0013 0.9900 1.0119 1.0052 1.0114 1.0120 1.0138 1.0170 1.0167 1.0240 1.0109 1.0088
dispcorr: -0.021222483 hartree
energy: -2488.797319959854
dipole: 24.06129 -24.10795 -0.04666 10.32437 -10.28478 0.03958 -16.73319 15.43526 -1.29793
magnitude: 1.29937 au
magnitude: 3.30274 debye
