program: Orca
programVersion: 5.0.2
elementType: S O O O N N C C C C C C C C C C C C C C C C C C C C H H H H H H H H H H H H H H H H H H H H H H H H H H H H H H H H
charge: 0
multiplicity: 1
keywords: wb97x-d3
keywords: def2-TZVPP
keywords: def2/J RIJCOSX
keywords: DEFGRID2
keywords: scfconv7
keywords: smallprint printgap noloewdin
keywords: NOSOSCF
formula: C20H32N2O3S
InChI: InChI=1/C20H32N2O3S/c1-6-8-13-22(14-9-7-2)26-21(5)19(23)24-17-12-10-11-16-15-20(3,4)25-18(16)17/h10-12H,6-9,13-15H2,1-5H3
58 atoms
S  -1.842203 2.042925 1.012344
O  1.473933 -1.406241 -0.033091
O  0.759061 1.00827 1.362031
O  0.237482 -0.758774 2.651207
N  -2.337711 1.453518 -0.461465
N  -1.373792 0.703061 1.991076
C  2.187886 -2.577204 -0.551655
C  3.678003 -2.164098 -0.567735
C  3.688954 -0.926148 0.274843
C  2.370674 -0.568621 0.509244
C  1.63745 -2.870249 -1.929808
C  1.938193 -3.718473 0.417189
C  4.721796 -0.142719 0.753266
C  2.060211 0.578016 1.220435
C  4.415084 1.008419 1.475146
C  3.092806 1.364799 1.707987
C  -3.60366 0.715541 -0.496637
C  -1.30413 0.905709 -1.341925
C  -4.428489 1.039314 -1.73458
C  -0.306649 1.945821 -1.824111
C  -5.73262 0.248233 -1.798068
C  0.875584 1.331664 -2.567441
C  -0.102464 0.229832 2.038994
C  -5.541409 -1.245513 -2.02222
C  0.491278 0.538497 -3.808288
C  -2.396462 -0.069887 2.686669
H  4.024996 -1.950163 -1.582094
H  4.31443 -2.955978 -0.17046
H  0.57128 -3.098376 -1.893696
H  2.148649 -3.734184 -2.355044
H  1.790956 -2.026514 -2.604333
H  0.87311 -3.935582 0.507662
H  2.330257 -3.490356 1.41017
H  2.436109 -4.621428 0.063467
H  5.752812 -0.412891 0.564676
H  5.208509 1.63476 1.859066
H  2.856215 2.265387 2.260357
H  -4.183222 0.98766 0.386692
H  -3.409127 -0.361079 -0.425467
H  -1.818071 0.47671 -2.202616
H  -0.785606 0.066967 -0.86022
H  -4.653394 2.108586 -1.729273
H  -3.851554 0.847373 -2.644472
H  -0.8219 2.658371 -2.475069
H  0.071989 2.518129 -0.974318
H  -6.342692 0.653175 -2.608827
H  -6.304526 0.413334 -0.88001
H  1.559256 2.134598 -2.853385
H  1.437907 0.688296 -1.884939
H  -4.956209 -1.435519 -2.924235
H  -6.500899 -1.750092 -2.142565
H  -5.026573 -1.726777 -1.189914
H  1.37736 0.201084 -4.34748
H  -0.100615 1.144228 -4.497753
H  -0.094354 -0.349144 -3.564315
H  -3.306116 0.521429 2.730467
H  -2.091964 -0.29192 3.708426
H  -2.616688 -1.005992 2.172121
elementType: S O N C H
totalener: -1514.91179392 hartree
nucrepener: 2780.89475465 hartree
electener: -4295.80654857 hartree
oneelecener: -7601.04497654 hartree
twoeener: 3305.23842796 hartree
cpcmener: -0.03289270 hartree
kineticenergy: 1509.09543256 hartree
xcener: -129.013921957349 hartree
chargesum: -0.0000000
charge: 0.017813 -0.369939 -0.307376 -0.512108 -0.129438 -0.163259 0.379055 -0.139430 -0.077216 0.295755 -0.320138 -0.325507 -0.177146 0.047428 -0.166313 -0.206173 -0.111367 -0.154784 -0.116981 -0.103679 -0.106313 -0.088040 0.494705 -0.272770 -0.312775 -0.177444 0.094285 0.101703 0.104742 0.112821 0.100089 0.100352 0.108101 0.103849 0.152190 0.160152 0.150755 0.097126 0.108332 0.123967 0.089246 0.068172 0.070390 0.077862 0.072628 0.071885 0.056049 0.077006 0.031723 0.080280 0.091672 0.078231 0.099936 0.096134 0.081077 0.104567 0.116283 0.121836
qa: 0.0178 -0.3699 -0.3074 -0.5121 -0.1294 -0.1633 0.3791 -0.1394 -0.0772 0.2958 -0.3201 -0.3255 -0.1771 0.0474 -0.1663 -0.2062 -0.1114 -0.1548 -0.1170 -0.1037 -0.1063 -0.0880 0.4947 -0.2728 -0.3128 -0.1774 0.0943 0.1017 0.1047 0.1128 0.1001 0.1004 0.1081 0.1038 0.1522 0.1602 0.1508 0.0971 0.1083 0.1240 0.0892 0.0682 0.0704 0.0779 0.0726 0.0719 0.0560 0.0770 0.0317 0.0803 0.0917 0.0782 0.0999 0.0961 0.0811 0.1046 0.1163 0.1218
va: 2.3293 2.0469 2.0838 1.9945 3.0209 3.1729 3.6923 4.0400 3.6745 3.8236 3.9426 3.9770 3.9483 3.7847 3.8764 3.9824 3.9048 3.9323 3.8782 3.8145 3.8948 3.8851 4.2496 3.9259 3.9366 3.8808 1.0077 1.0036 1.0053 1.0053 0.9950 1.0083 0.9980 1.0051 0.9960 0.9881 0.9989 1.0071 0.9853 0.9805 1.0205 1.0227 1.0169 1.0160 1.0316 1.0064 1.0080 1.0113 1.0226 1.0016 1.0039 1.0012 1.0012 1.0035 0.9949 1.0096 1.0011 0.9868
dispcorr: -0.033318598 hartree
energy: -1514.945112521045
dipole: -18.89144 18.71691 -0.17454 -13.87937 12.91945 -0.95992 -28.81859 27.08567 -1.73292
magnitude: 1.98870 au
magnitude: 5.05488 debye
