program: Orca
programVersion: 5.0.2
elementType: S O O O N N C C C C C C C C C C C C C C C C C C C C H H H H H H H H H H H H H H H H H H H H H H H H H H H H H H H H
charge: 0
multiplicity: 1
keywords: wb97x-d3
keywords: def2-TZVPP
keywords: def2/J RIJCOSX
keywords: DEFGRID2
keywords: scfconv7
keywords: smallprint printgap noloewdin
keywords: NOSOSCF
formula: C20H32N2O3S
InChI: InChI=1/C20H32N2O3S/c1-6-8-13-22(14-9-7-2)26-21(5)19(23)24-17-12-10-11-16-15-20(3,4)25-18(16)17/h10-12H,6-9,13-15H2,1-5H3
58 atoms
S  -2.141363 1.425628 0.629401
O  1.621696 -1.551568 -0.078585
O  0.5644 0.821299 1.167759
O  0.244226 -0.960241 2.499939
N  -2.381541 0.723477 -0.862034
N  -1.529222 0.22315 1.706073
C  2.495039 -2.651305 -0.498475
C  3.914789 -2.039884 -0.536078
C  3.745621 -0.760292 0.223561
C  2.387312 -0.569086 0.419816
C  2.007873 -3.120859 -1.851294
C  2.383225 -3.736734 0.555877
C  4.655287 0.184541 0.659549
C  1.911918 0.565579 1.055471
C  4.182795 1.328136 1.299256
C  2.820588 1.515987 1.49689
C  -3.453352 -0.268478 -0.974548
C  -1.191034 0.376254 -1.639805
C  -4.804573 0.185595 -0.453174
C  -0.285462 1.553565 -1.9566
C  -5.33041 1.462139 -1.09463
C  0.961213 1.107457 -2.71231
C  -0.206661 -0.053179 1.835783
C  -6.751732 1.780944 -0.657579
C  1.969924 2.230637 -2.889607
C  -2.461708 -0.651353 2.408649
H  4.24124 -1.844472 -1.561131
H  4.648432 -2.710395 -0.086545
H  2.6386 -3.934739 -2.209358
H  2.048261 -2.316938 -2.587784
H  0.983379 -3.491964 -1.7985
H  3.004099 -4.589327 0.279411
H  1.355404 -4.088456 0.653982
H  2.721813 -3.381589 1.531014
H  5.716874 0.045075 0.500587
H  4.877476 2.080053 1.647887
H  2.455351 2.408249 1.989475
H  -3.167243 -1.211634 -0.491603
H  -3.554253 -0.490002 -2.039983
H  -1.548643 -0.048113 -2.580992
H  -0.621801 -0.423052 -1.150483
H  -5.50112 -0.633731 -0.655861
H  -4.787899 0.298544 0.633885
H  -0.836596 2.284768 -2.554868
H  0.014116 2.066014 -1.040815
H  -5.293943 1.362303 -2.183945
H  -4.678846 2.302533 -0.844308
H  1.436744 0.280569 -2.177324
H  0.675333 0.708644 -3.690053
H  -7.442951 0.984138 -0.938996
H  -7.112483 2.704601 -1.11192
H  -6.815368 1.901827 0.425635
H  2.312407 2.604586 -1.922365
H  1.540493 3.072572 -3.435843
H  2.848571 1.895163 -3.441994
H  -2.152004 -0.801392 3.44215
H  -2.552793 -1.623399 1.92197
H  -3.438851 -0.176687 2.420256
elementType: S O N C H
totalener: -1514.91227765 hartree
nucrepener: 2794.12711288 hartree
electener: -4309.03939054 hartree
oneelecener: -7627.69057808 hartree
twoeener: 3318.65118755 hartree
cpcmener: -0.03219190 hartree
kineticenergy: 1509.10172096 hartree
xcener: -129.015747185604 hartree
chargesum: 0.0000000
charge: 0.017913 -0.371879 -0.304402 -0.510970 -0.125315 -0.159117 0.364366 -0.132344 -0.079280 0.312775 -0.310547 -0.325295 -0.175119 0.044080 -0.158511 -0.219029 -0.132993 -0.128497 -0.127197 -0.122025 -0.066693 -0.060655 0.491898 -0.282885 -0.293881 -0.187479 0.093221 0.102282 0.111057 0.101881 0.102096 0.103980 0.099599 0.108585 0.151945 0.159371 0.149237 0.114349 0.106324 0.106807 0.080221 0.076627 0.070445 0.082197 0.064524 0.060777 0.048958 0.017354 0.079570 0.078951 0.089844 0.079003 0.074574 0.086268 0.092477 0.116845 0.121347 0.112365
qa: 0.0179 -0.3719 -0.3044 -0.5110 -0.1253 -0.1591 0.3644 -0.1323 -0.0793 0.3128 -0.3105 -0.3253 -0.1751 0.0441 -0.1585 -0.2190 -0.1330 -0.1285 -0.1272 -0.1220 -0.0667 -0.0607 0.4919 -0.2829 -0.2939 -0.1875 0.0932 0.1023 0.1111 0.1019 0.1021 0.1040 0.0996 0.1086 0.1519 0.1594 0.1492 0.1143 0.1063 0.1068 0.0802 0.0766 0.0704 0.0822 0.0645 0.0608 0.0490 0.0174 0.0796 0.0790 0.0898 0.0790 0.0746 0.0863 0.0925 0.1168 0.1213 0.1124
va: 2.3345 2.0404 2.0765 1.9962 3.0176 3.1792 3.7196 4.0326 3.6763 3.7757 3.9377 3.9753 3.9517 3.7452 3.8693 3.9697 3.9150 3.9201 3.8541 3.8205 3.8454 3.8736 4.2551 3.9509 3.9565 3.8858 1.0088 1.0035 1.0039 0.9979 1.0059 1.0054 1.0089 0.9980 0.9958 0.9880 1.0002 0.9929 0.9987 1.0014 1.0121 1.0144 1.0141 1.0174 1.0269 1.0101 1.0213 1.0198 1.0079 1.0010 1.0038 0.9999 1.0004 1.0013 1.0032 1.0034 0.9872 1.0027
dispcorr: -0.033794339 hartree
energy: -1514.946071993188
dipole: -15.46194 15.56187 0.09993 -5.19378 4.10981 -1.08397 -21.78373 20.10432 -1.67941
magnitude: 2.00135 au
magnitude: 5.08703 debye
