program: Orca
programVersion: 5.0.2
elementType: S O O O N N C C C C C C C C C C C C C C C C C C C C H H H H H H H H H H H H H H H H H H H H H H H H H H H H H H H H
charge: 0
multiplicity: 1
keywords: wb97x-d3
keywords: def2-TZVPP
keywords: def2/J RIJCOSX
keywords: DEFGRID2
keywords: scfconv7
keywords: smallprint printgap noloewdin
keywords: NOSOSCF
formula: C20H32N2O3S
InChI: InChI=1/C20H32N2O3S/c1-6-8-13-22(14-9-7-2)26-21(5)19(23)24-17-12-10-11-16-15-20(3,4)25-18(16)17/h10-12H,6-9,13-15H2,1-5H3
58 atoms
S  -1.372654 2.293195 0.586519
O  1.312621 -1.722783 -0.21183
O  0.368305 0.290988 1.598848
O  2.277819 1.048584 0.689795
N  -2.067031 1.562011 -0.744761
N  0.341067 2.204109 0.41452
C  1.939752 -2.897793 -0.829391
C  2.30549 -3.834232 0.349062
C  1.994751 -3.004743 1.555657
C  1.425143 -1.819936 1.12017
C  3.169082 -2.405903 -1.568031
C  0.921745 -3.51255 -1.766256
C  2.154362 -3.246767 2.906797
C  1.00597 -0.856281 2.022124
C  1.733119 -2.28224 3.818865
C  1.166527 -1.092494 3.378363
C  -1.973078 0.100342 -0.815651
C  -1.862118 2.211346 -2.043704
C  -2.687349 -0.609597 0.322769
C  -2.248876 3.677742 -2.094426
C  -2.424192 -2.113315 0.338516
C  -2.098503 4.235644 -3.506307
C  1.086945 1.168864 0.876043
C  -2.851249 -2.838996 -0.929558
C  -2.434062 5.716736 -3.587717
C  1.042996 3.226011 -0.356661
H  3.354205 -4.133878 0.30811
H  1.710696 -4.750398 0.331666
H  2.90485 -1.677083 -2.335595
H  3.668415 -3.24231 -2.058031
H  3.884647 -1.94492 -0.884873
H  0.622892 -2.811938 -2.547249
H  0.030099 -3.834039 -1.2257
H  1.350973 -4.389471 -2.251833
H  2.593407 -4.173317 3.253492
H  1.848315 -2.45345 4.880187
H  0.837803 -0.345025 4.089102
H  -0.928415 -0.226455 -0.884945
H  -2.437107 -0.188193 -1.760163
H  -2.484833 1.668097 -2.758265
H  -0.826168 2.084926 -2.384368
H  -2.375959 -0.191133 1.281678
H  -3.762184 -0.42491 0.237867
H  -3.283757 3.794466 -1.760971
H  -1.633768 4.268263 -1.41228
H  -2.949897 -2.545965 1.192942
H  -1.360672 -2.29235 0.519819
H  -1.073462 4.075141 -3.85285
H  -2.742445 3.676547 -4.190803
H  -2.273278 -2.522703 -1.799175
H  -3.905314 -2.659969 -1.152474
H  -2.716331 -3.916822 -0.828897
H  -3.45861 5.909638 -3.264998
H  -2.334061 6.092439 -4.606681
H  -1.772572 6.308479 -2.95259
H  0.382036 4.076429 -0.489022
H  1.338854 2.860446 -1.340044
H  1.92937 3.573074 0.172405
elementType: S O N C H
totalener: -1514.91266462 hartree
nucrepener: 2772.96834357 hartree
electener: -4287.88100818 hartree
oneelecener: -7585.25241060 hartree
twoeener: 3297.37140241 hartree
cpcmener: -0.03283189 hartree
kineticenergy: 1509.08946618 hartree
xcener: -129.012513096266 hartree
chargesum: -0.0000000
charge: 0.019853 -0.367389 -0.311619 -0.511922 -0.122338 -0.161886 0.384025 -0.152372 -0.081415 0.319375 -0.319286 -0.332572 -0.166676 0.022213 -0.174270 -0.194216 -0.145163 -0.128636 -0.105456 -0.098534 -0.092483 -0.077227 0.499022 -0.312924 -0.288185 -0.187931 0.100482 0.096703 0.100362 0.103219 0.106041 0.105904 0.103972 0.116034 0.152828 0.159212 0.150463 0.084981 0.111891 0.103344 0.095582 0.075503 0.077473 0.070597 0.058187 0.078665 0.033614 0.058322 0.062187 0.082499 0.095959 0.099380 0.079212 0.091085 0.080075 0.113727 0.121059 0.119450
qa: 0.0199 -0.3674 -0.3116 -0.5119 -0.1223 -0.1619 0.3840 -0.1524 -0.0814 0.3194 -0.3193 -0.3326 -0.1667 0.0222 -0.1743 -0.1942 -0.1452 -0.1286 -0.1055 -0.0985 -0.0925 -0.0772 0.4990 -0.3129 -0.2882 -0.1879 0.1005 0.0967 0.1004 0.1032 0.1060 0.1059 0.1040 0.1160 0.1528 0.1592 0.1505 0.0850 0.1119 0.1033 0.0956 0.0755 0.0775 0.0706 0.0582 0.0787 0.0336 0.0583 0.0622 0.0825 0.0960 0.0994 0.0792 0.0911 0.0801 0.1137 0.1211 0.1195
va: 2.3244 2.0513 2.0837 1.9950 3.0509 3.1714 3.6661 4.0715 3.6866 3.8180 3.9763 3.9544 3.9385 3.7842 3.8823 3.9812 3.9388 3.9320 3.7919 3.8349 3.8867 3.8741 4.2406 3.9389 3.9529 3.8851 1.0036 1.0065 1.0070 1.0041 0.9991 1.0048 0.9927 1.0058 0.9952 0.9884 0.9981 1.0158 0.9933 0.9989 0.9875 1.0326 1.0170 1.0198 1.0222 1.0112 1.0199 1.0080 1.0080 0.9940 1.0041 1.0012 0.9996 1.0037 0.9998 0.9991 0.9877 1.0015
dispcorr: -0.033179879 hartree
energy: -1514.945844494779
dipole: -14.44354 14.03557 -0.40797 -0.17360 -1.03345 -1.20705 -29.12859 27.65469 -1.47390
magnitude: 1.94828 au
magnitude: 4.95214 debye
