program: Gaussian 09
title: 000065154
version: EM64L-G09RevD.01
frameworkgroup: C1[X(C5H5N5O2)]
method: RPBEPBE
basis: SDD
operation: Freq
keyword: #pfreq=noraman
keyword: PBEPBE/SDD
title: #p freq=noraman PBEPBE/SDD
converged: NO YES NO YES
title: Mulliken charges:
elementType: O O N N N N N C C C C C H H H H H
charge: -0.234037 -0.246617 -0.449091 -0.408159 -0.414740 -0.042844 -0.624843 0.323610 0.106623 0.125835 0.011587 0.182794 0.333272 0.353767 0.312542 0.359729 0.310574
chargesum: 0.00000
title: Mulliken charges with hydrogens summed into heavy atoms:
elementType: O O N N N N N C C C C C
charge: -0.234037 -0.246617 -0.115819 -0.054392 -0.102199 -0.042844 0.045460 0.323610 0.106623 0.125835 0.011587 0.182794
polarizability: 1.39701226e+02 -1.56999255e+00 1.10998709e+02 4.39226826e-03 -2.67114460e-03 3.85254388e+01
1716.lowfreq: -3.2200 -3.1839 -0.0011 -0.0010 -0.0009 3.3679 70.6077 110.0443 144.8904
frequency: 70.6075 110.0437 144.8899 207.8535 219.5935 253.8253 320.3810 328.1402 430.4152 443.6271 447.2704 504.6622 524.1545 525.3770 592.6794 599.5669 630.9326 637.3652 681.5789 703.8665 735.4094 747.0102 834.0300 923.1118 951.3643 978.9721 1119.5560 1166.2006 1230.7874 1260.2640 1269.1273 1324.3146 1393.2791 1415.4217 1533.5997 1573.6207 1598.5063 1633.5854 1658.7537 1710.6101 3552.5967 3560.4830 3615.0365 3617.9797 3706.5613
redmass: 1.8924 4.2712 3.5678 3.5797 8.5902 6.1524 4.1699 6.5232 6.4200 9.0253 1.2045 1.2838 1.1604 6.6498 7.8723 1.2988 2.9968 5.1090 8.8009 11.8572 6.4430 11.1905 6.1187 5.0427 3.5644 2.4917 5.5218 3.0457 2.7173 1.6623 2.5935 1.7701 3.3005 6.4394 5.6061 4.9465 1.7296 2.9195 6.5921 8.4731 1.0532 1.0705 1.0813 1.0815 1.1053
irintensity: 6.0014 12.6361 3.9240 22.9849 6.5492 7.6755 1.8190 0.8466 2.3142 7.5543 134.5264 272.9462 63.6394 0.8407 6.4911 92.2361 142.2860 8.8713 0.3126 20.2044 18.0859 12.1206 2.9967 35.2299 21.1835 51.1542 7.0386 13.2188 32.5212 67.9061 15.0607 95.1708 90.9311 10.8982 152.8588 408.9475 94.2926 419.0370 478.6630 657.1338 74.0718 72.4054 93.8640 76.2942 45.5244
temp: 298.150 k
press: 1.00000 atm
elementType: 8 8 7 7 7 7 7 6 6 6 6 6 1 1 1 1 1
symmnumber: 1
zpe: 307960.7 jmol-1
zpe.correction: 0.117296 hartree
zpe.thermalcorrener: 0.127444 hartree
zpe.thermalcorrenthalpy: 0.128388 hartree
zpe.thermalcorrgfe: 0.081692 hartree
zpe.sumelectzpe: -616.912888 hartree
zpe.sumelectthermal: -616.902740 hartree
zpe.sumelectthermalent: -616.901796 hartree
zpe.sumelectthermalfe: -616.948493 hartree
dipole: 3.9958 -8.8425 0.0001
dipole: 9.7035
quadrupole: -74.9160 -63.7856 -70.4839
quadrupole: -17.7635 -0.0026 0.0011
quadrupole: -5.1875 5.9429 -0.7554 -17.7635 -0.0026 0.0011
hfenergy: -617.0301841 hartree
pointgroup: C01 [X(C5H5N5O2)]
dipole: -1.4257474 3.5414105 0.0000423 debye
dipolederiv: -1.7623433 -0.1416399 0.0000659 -0.1143872 -0.4282056 0.0000051 0.0000904 0.0000086 -0.3867028 -0.5113569 0.0510368 0.0000099 -0.1255447 -1.3586 0.0000094 -0.000001 -0.0001135 -0.3868536 -1.0814308 -0.1686086 0.0000271 0.3096302 -0.4943012 -0.0000295 0.0000557 -0.000012 -0.3381867 -0.9322379 0.0637843 0.0000364 -0.4693209 -0.4888361 0.0000173 0.000025 -0.0000003 -0.3079567 -1.0056988 0.2433732 0.0000203 -0.2793796 -0.6659416 0.0000126 0.0000172 -0.0000417 -0.2397876 -0.8642789 0.3997363 0.0000434 0.6429953 -1.2518186 -0.0000573 -0.0000231 -0.0000175 -0.3085129 -1.3725067 0.5673405 0.0000854 0.626915 -0.531714 -0.0001857 0.0002603 -0.0002709 -0.7601286 0.9612615 0.0271102 -0.0000431 0.3651569 0.7333552 0.0000044 -0.0000224 0.0000618 0.0964726 0.1124048 -0.5598266 -0.0000317 -0.5939073 -0.5721414 0.0000034 0.0000016 -0.0000078 -0.0204499 2.3974892 0.1223091 -0.000121 0.0656033 0.7720346 0.0000136 -0.0001566 0.0000085 0.2682619 1.2438518 -0.0998991 -0.0000564 0.0554659 1.8982418 0.000024 -0.0000411 0.0000972 0.2333757 1.7856107 -0.3793819 -0.0000494 -0.4533826 1.4304772 0.0001134 -0.0000356 0.0001081 0.2424407 0.174753 0.0240467 0.0000111 0.0478931 0.2305546 -0.0000064 0.0000128 -0.0000005 0.3777334 0.2086629 -0.0702255 0.0000054 -0.022408 0.2718908 -0.0000026 0.0000081 -0.000001 0.3677466 0.1345448 -0.0259274 0.0000096 -0.0249424 0.1518104 -0.0000136 0.0000073 -0.0000201 0.3576181 0.3126531 -0.0132394 -0.0000254 0.0305238 0.1561528 0.0000178 -0.0000795 0.0000274 0.4013395 0.1986214 -0.0399887 0.0000125 -0.0609107 0.1470411 0.0000742 -0.0001191 0.0001738 0.4035904 unknown
polarizability: 139.5206456|-2.7595975|111.1792893|-0.0042771|0.0028519|38.5254388 unknown
InChI: InChI=1S/C5H5N5O2/c6-4-8-2-1(3(11)10-4)7-5(12)9-2/h7-9H,6H2
charge 0 multiplicity 1
17 atoms
O  3.760419 0.348005 -0.000135
O  -0.831478 -2.669002 -0.000076
N  1.560247 1.331505 0.000044
N  1.695506 -0.901966 -0.000043
N  -0.955319 1.490288 0.000187
N  -2.084167 -0.656354 0.000082
N  -3.324905 1.327841 0.000211
C  0.264765 0.825495 0.000082
C  0.328005 -0.560474 0.000023
C  2.509077 0.241491 -0.000053
C  -0.864672 -1.401534 0.000085
C  -2.109294 0.667876 0.000166
H  1.873872 2.299843 0.000061
H  2.051227 -1.856047 -0.000069
H  -1.015052 2.508568 0.000271
H  -4.152078 0.735577 0.000178
H  -3.425653 2.338787 -0.000115
