program: Orca
programVersion: 5.0.2
elementType: S O O O N N C C C C C C C C C C C C C C C C C C C C H H H H H H H H H H H H H H H H H H H H H H H H H H H H H H H H
charge: 0
multiplicity: 1
keywords: wb97x-d3
keywords: def2-TZVPP
keywords: def2/J RIJCOSX
keywords: DEFGRID2
keywords: scfconv7
keywords: smallprint printgap noloewdin
keywords: NOSOSCF
formula: C20H32N2O3S
InChI: InChI=1/C20H32N2O3S/c1-6-8-13-22(14-9-7-2)26-21(5)19(23)24-17-12-10-11-16-15-20(3,4)25-18(16)17/h10-12H,6-9,13-15H2,1-5H3
58 atoms
S  -2.024556 2.051304 0.990447
O  1.426679 -0.772519 -0.372601
O  -0.138569 0.12063 1.832429
O  1.716636 1.381701 1.750651
N  -2.309205 1.456242 -0.525356
N  -0.319983 2.266285 1.222687
C  2.387395 -1.458458 -1.239809
C  2.616362 -2.838451 -0.576154
C  1.995319 -2.667834 0.775624
C  1.328479 -1.455424 0.777798
C  3.654648 -0.623401 -1.248392
C  1.762285 -1.556503 -2.614329
C  1.948539 -3.488718 1.887362
C  0.608632 -1.034741 1.882321
C  1.226037 -3.071191 3.002908
C  0.562848 -1.848955 3.002389
C  -2.204108 0.019194 -0.779173
C  -2.004721 2.297878 -1.678215
C  -3.030972 -0.836186 0.166254
C  -0.59991 2.12744 -2.254563
C  -3.088018 -2.299084 -0.268026
C  -0.249998 3.221766 -3.258184
C  0.518908 1.274864 1.6036
C  -1.749674 -3.024188 -0.224153
C  -1.164574 3.259488 -4.474565
C  0.214527 3.595487 0.961764
H  3.678688 -3.082679 -0.526121
H  2.127613 -3.640417 -1.135522
H  3.461645 0.38326 -1.621694
H  4.400195 -1.084333 -1.896913
H  4.086124 -0.544399 -0.248799
H  0.82974 -2.122263 -2.583651
H  2.442692 -2.068122 -3.295332
H  1.55518 -0.568387 -3.029179
H  2.45741 -4.444092 1.890779
H  1.177988 -3.699205 3.881991
H  -0.003324 -1.530381 3.868447
H  -1.161111 -0.306365 -0.7926
H  -2.580855 -0.13135 -1.795581
H  -2.163826 3.337383 -1.382336
H  -2.746641 2.074452 -2.450161
H  -2.63869 -0.7751 1.183557
H  -4.047563 -0.43584 0.200758
H  0.137426 2.133306 -1.448031
H  -0.513156 1.149859 -2.739303
H  -3.503968 -2.360987 -1.278163
H  -3.794784 -2.822245 0.380565
H  -0.272474 4.192699 -2.753202
H  0.781041 3.076991 -3.589396
H  -1.022829 -2.593338 -0.914874
H  -1.866982 -4.073849 -0.496917
H  -1.31514 -2.993004 0.777171
H  -2.195266 3.49679 -4.207436
H  -1.172084 2.29777 -4.99154
H  -0.836467 4.014533 -5.189933
H  1.300385 3.583676 0.963991
H  -0.121751 4.303556 1.718471
H  -0.114817 3.951882 -0.012399
elementType: S O N C H
totalener: -1514.90911855 hartree
nucrepener: 2859.86751615 hartree
electener: -4374.77663471 hartree
oneelecener: -7758.95298550 hartree
twoeener: 3384.17635079 hartree
cpcmener: -0.03200269 hartree
kineticenergy: 1509.10392137 hartree
xcener: -129.020989967017 hartree
chargesum: 0.0000000
charge: 0.014482 -0.365474 -0.312377 -0.511295 -0.143887 -0.151861 0.362109 -0.137760 -0.122242 0.351790 -0.327565 -0.322653 -0.155288 0.030955 -0.167488 -0.205536 -0.083871 -0.096042 -0.113941 -0.123775 -0.102061 -0.105690 0.467672 -0.262405 -0.275306 -0.182386 0.103067 0.095106 0.100973 0.104932 0.109226 0.108252 0.117805 0.100135 0.151907 0.159191 0.148791 0.042608 0.107696 0.102316 0.098879 0.068285 0.078887 0.075961 0.076803 0.057420 0.071102 0.058407 0.070251 0.061808 0.101355 0.067608 0.080935 0.081848 0.092073 0.114221 0.128356 0.105689
qa: 0.0145 -0.3655 -0.3124 -0.5113 -0.1439 -0.1519 0.3621 -0.1378 -0.1222 0.3518 -0.3276 -0.3227 -0.1553 0.0310 -0.1675 -0.2055 -0.0839 -0.0960 -0.1139 -0.1238 -0.1021 -0.1057 0.4677 -0.2624 -0.2753 -0.1824 0.1031 0.0951 0.1010 0.1049 0.1092 0.1083 0.1178 0.1001 0.1519 0.1592 0.1488 0.0426 0.1077 0.1023 0.0989 0.0683 0.0789 0.0760 0.0768 0.0574 0.0711 0.0584 0.0703 0.0618 0.1014 0.0676 0.0809 0.0818 0.0921 0.1142 0.1284 0.1057
va: 2.3234 2.0427 2.0612 1.9973 3.0338 3.1418 3.7083 4.0405 3.6940 3.7458 3.9791 3.9436 3.9317 3.7375 3.8735 3.9706 3.9102 3.8958 3.8792 3.8086 3.9155 3.9125 4.2868 3.9428 3.9341 3.8881 1.0039 1.0088 1.0061 1.0051 0.9978 0.9918 1.0050 1.0032 0.9951 0.9883 1.0005 1.0044 0.9960 1.0070 0.9964 1.0225 1.0189 1.0159 1.0111 1.0098 1.0071 1.0078 1.0064 1.0016 1.0059 1.0035 0.9985 0.9991 1.0050 1.0173 0.9958 0.9916
dispcorr: -0.036694170 hartree
energy: -1514.945812722684
dipole: -3.28358 3.24072 -0.04286 -1.48919 0.59768 -0.89151 -31.76523 29.60173 -2.16351
magnitude: 2.34038 au
magnitude: 5.94877 debye
