program: Orca
programVersion: 5.0.2
elementType: S O O O N N C C C C C C C C C C C C C C C C C C C C H H H H H H H H H H H H H H H H H H H H H H H H H H H H H H H H
charge: 0
multiplicity: 1
keywords: wb97x-d3
keywords: def2-TZVPP
keywords: def2/J RIJCOSX
keywords: DEFGRID2
keywords: scfconv7
keywords: smallprint printgap noloewdin
keywords: NOSOSCF
formula: C20H32N2O3S
InChI: InChI=1/C20H32N2O3S/c1-6-8-13-22(14-9-7-2)26-21(5)19(23)24-17-12-10-11-16-15-20(3,4)25-18(16)17/h10-12H,6-9,13-15H2,1-5H3
58 atoms
S  -1.939452 2.188781 0.852432
O  0.951139 -1.414214 0.048082
O  0.646457 1.139631 1.274298
O  0.160712 -0.396943 2.835584
N  -2.185218 1.57231 -0.661337
N  -1.476145 0.920764 1.942535
C  1.465575 -2.673069 -0.501175
C  2.990161 -2.453094 -0.663516
C  3.226589 -1.166614 0.065203
C  1.991106 -0.648488 0.411482
C  0.760197 -2.910866 -1.818992
C  1.160294 -3.760101 0.511694
C  4.381534 -0.463632 0.355987
C  1.881367 0.576005 1.048262
C  4.27805 0.765429 1.00312
C  3.03465 1.281694 1.350125
C  -3.306343 0.662643 -0.880793
C  -1.054993 1.377189 -1.570378
C  -2.975756 -0.8214 -0.731874
C  -0.189344 2.613225 -1.752521
C  -4.225106 -1.696941 -0.704903
C  0.839307 2.448074 -2.870162
C  -0.205758 0.47671 2.080191
C  -5.060067 -1.625878 -1.976358
C  1.886126 1.371708 -2.614311
C  -2.538754 0.313374 2.732399
H  3.273676 -2.366076 -1.715573
H  3.557944 -3.28657 -0.247104
H  0.95003 -2.095449 -2.5190
H  -0.318292 -3.008932 -1.683525
H  1.124504 -3.832495 -2.273226
H  1.509812 -4.723292 0.139167
H  0.088066 -3.840658 0.695555
H  1.66154 -3.568412 1.462179
H  5.351493 -0.85611 0.0788
H  5.170294 1.328491 1.240478
H  2.956208 2.242628 1.842538
H  -3.688812 0.853568 -1.887462
H  -4.100761 0.93967 -0.18435
H  -1.494215 1.120931 -2.539295
H  -0.450371 0.515805 -1.275131
H  -2.328077 -1.142477 -1.553946
H  -2.404461 -0.98331 0.185961
H  -0.836156 3.462191 -1.988766
H  0.324284 2.863713 -0.821786
H  -4.84209 -1.41644 0.154536
H  -3.921883 -2.73268 -0.534165
H  0.321584 2.237781 -3.810828
H  1.345282 3.405803 -3.014184
H  -5.896426 -2.32473 -1.935113
H  -4.463228 -1.879628 -2.854817
H  -5.479085 -0.632279 -2.14002
H  2.62072 1.345089 -3.42031
H  1.447575 0.374814 -2.546125
H  2.428061 1.559342 -1.684853
H  -3.358226 0.004076 2.086548
H  -2.92622 1.017502 3.468096
H  -2.175684 -0.564753 3.258042
elementType: S O N C H
totalener: -1514.90900612 hartree
nucrepener: 2853.39636229 hartree
electener: -4368.30536841 hartree
oneelecener: -7746.00938438 hartree
twoeener: 3377.70401598 hartree
cpcmener: -0.03237154 hartree
kineticenergy: 1509.08590507 hartree
xcener: -129.016965462457 hartree
chargesum: -0.0000000
charge: 0.014401 -0.368175 -0.311927 -0.512661 -0.143852 -0.153612 0.363807 -0.137046 -0.124762 0.358629 -0.326268 -0.323110 -0.156020 0.024950 -0.168927 -0.200796 -0.097080 -0.081344 -0.124286 -0.114554 -0.106919 -0.103948 0.468315 -0.276353 -0.264120 -0.180139 0.096096 0.101746 0.109181 0.099673 0.118136 0.103773 0.100719 0.107865 0.152303 0.159327 0.147852 0.099644 0.101818 0.106896 0.042453 0.076429 0.078005 0.079611 0.067974 0.059628 0.070058 0.058278 0.071029 0.092691 0.082279 0.081443 0.102002 0.064479 0.067301 0.105622 0.127687 0.113800
qa: 0.0144 -0.3682 -0.3119 -0.5127 -0.1439 -0.1536 0.3638 -0.1370 -0.1248 0.3586 -0.3263 -0.3231 -0.1560 0.0250 -0.1689 -0.2008 -0.0971 -0.0813 -0.1243 -0.1146 -0.1069 -0.1039 0.4683 -0.2764 -0.2641 -0.1801 0.0961 0.1017 0.1092 0.0997 0.1181 0.1038 0.1007 0.1079 0.1523 0.1593 0.1479 0.0996 0.1018 0.1069 0.0425 0.0764 0.0780 0.0796 0.0680 0.0596 0.0701 0.0583 0.0710 0.0927 0.0823 0.0814 0.1020 0.0645 0.0673 0.1056 0.1277 0.1138
va: 2.3247 2.0448 2.0588 1.9971 3.0344 3.1417 3.7047 4.0463 3.6994 3.7466 3.9477 3.9784 3.9323 3.7323 3.8732 3.9679 3.8952 3.9080 3.8105 3.8793 3.9112 3.9156 4.2881 3.9334 3.9413 3.8889 1.0081 1.0043 0.9911 1.0036 1.0048 1.0046 1.0060 0.9982 0.9949 0.9883 1.0007 0.9964 1.0072 0.9957 1.0039 1.0113 1.0153 1.0184 1.0228 1.0076 1.0062 1.0098 1.0072 1.0047 0.9991 0.9984 1.0060 1.0000 1.0042 0.9917 0.9959 1.0171
dispcorr: -0.036380613 hartree
energy: -1514.945386735084
dipole: -13.60354 13.38699 -0.21654 -15.22491 14.04341 -1.18149 -24.93240 22.85815 -2.07425
magnitude: 2.39694 au
magnitude: 6.09254 debye
