program: Orca
programVersion: 5.0.2
elementType: S O O O N N C C C C C C C C C C C C C C C C C C C C H H H H H H H H H H H H H H H H H H H H H H H H H H H H H H H H
charge: 0
multiplicity: 1
keywords: wb97x-d3
keywords: def2-TZVPP
keywords: def2/J RIJCOSX
keywords: DEFGRID2
keywords: scfconv7
keywords: smallprint printgap noloewdin
keywords: NOSOSCF
formula: C20H32N2O3S
InChI: InChI=1/C20H32N2O3S/c1-6-8-13-22(14-9-7-2)26-21(5)19(23)24-17-12-10-11-16-15-20(3,4)25-18(16)17/h10-12H,6-9,13-15H2,1-5H3
58 atoms
S  -1.33255 2.720042 0.772116
O  0.910413 -1.333545 0.229044
O  1.191291 1.411515 0.981617
O  0.755955 0.202181 2.826489
N  -1.879942 1.810297 -0.496799
N  -0.769201 1.691791 2.04495
C  1.168724 -2.763613 0.052792
C  2.620002 -2.833018 -0.472154
C  3.170567 -1.497925 -0.07058
C  2.094848 -0.705055 0.294795
C  0.141551 -3.294213 -0.92197
C  1.045463 -3.412568 1.420191
C  4.452259 -0.981049 -0.054241
C  2.273496 0.610566 0.684492
C  4.638263 0.343987 0.334932
C  3.556498 1.134636 0.704828
C  -0.904636 1.344218 -1.483032
C  -3.045759 0.950795 -0.289344
C  -1.494073 1.179933 -2.875445
C  -2.71184 -0.496481 0.062453
C  -0.426566 0.734176 -3.86808
C  -3.937014 -1.30678 0.471919
C  0.413191 1.031019 2.012425
C  -0.965957 0.585533 -5.281832
C  -4.992527 -1.426854 -0.618411
C  -1.69086 1.323983 3.113257
H  2.649403 -2.953326 -1.558939
H  3.161304 -3.673881 -0.037387
H  0.194705 -2.771313 -1.878137
H  -0.870695 -3.193706 -0.526322
H  0.321731 -4.352993 -1.108328
H  1.212771 -4.486879 1.338511
H  0.051398 -3.258023 1.841904
H  1.782691 -3.014475 2.120253
H  5.298622 -1.591315 -0.341984
H  5.633669 0.765935 0.357712
H  3.705674 2.162771 1.009226
H  -0.448308 0.398735 -1.17673
H  -0.103842 2.083012 -1.526929
H  -3.657481 0.979255 -1.194311
H  -3.650524 1.398624 0.50186
H  -2.30136 0.441436 -2.870446
H  -1.93386 2.126073 -3.203939
H  -2.234675 -0.985232 -0.793146
H  -1.981527 -0.521304 0.875098
H  0.000262 -0.21747 -3.536304
H  0.396945 1.454343 -3.865365
H  -3.605246 -2.307407 0.760145
H  -4.383342 -0.865133 1.368258
H  -1.378684 1.526877 -5.649078
H  -1.760874 -0.161003 -5.326918
H  -0.184672 0.275764 -5.976887
H  -5.787976 -2.111315 -0.321311
H  -4.559161 -1.808734 -1.54521
H  -5.460857 -0.468259 -0.845089
H  -2.559733 1.971458 3.056416
H  -1.230417 1.464835 4.089798
H  -2.025735 0.289837 3.027509
elementType: S O N C H
totalener: -1514.91100833 hartree
nucrepener: 2817.78675968 hartree
electener: -4332.69776801 hartree
oneelecener: -7674.60406228 hartree
twoeener: 3341.90629427 hartree
cpcmener: -0.03205510 hartree
kineticenergy: 1509.09741417 hartree
xcener: -129.016724977626 hartree
chargesum: 0.0000000
charge: 0.009892 -0.371180 -0.317656 -0.508418 -0.142105 -0.165804 0.367088 -0.113225 -0.115646 0.314857 -0.322137 -0.334928 -0.188160 0.086413 -0.155075 -0.216725 -0.073035 -0.110766 -0.107572 -0.130664 -0.076610 -0.103813 0.486677 -0.286189 -0.277700 -0.167189 0.091358 0.101139 0.101640 0.099658 0.116585 0.106217 0.101208 0.110291 0.152659 0.158945 0.150688 0.046854 0.098638 0.109001 0.104305 0.066820 0.068636 0.071890 0.072102 0.056733 0.061457 0.070482 0.062003 0.079721 0.080093 0.091092 0.093300 0.081549 0.081859 0.100947 0.120722 0.111080
qa: 0.0099 -0.3712 -0.3177 -0.5084 -0.1421 -0.1658 0.3671 -0.1132 -0.1156 0.3149 -0.3221 -0.3349 -0.1882 0.0864 -0.1551 -0.2167 -0.0730 -0.1108 -0.1076 -0.1307 -0.0766 -0.1038 0.4867 -0.2862 -0.2777 -0.1672 0.0914 0.1011 0.1016 0.0997 0.1166 0.1062 0.1012 0.1103 0.1527 0.1589 0.1507 0.0469 0.0986 0.1090 0.1043 0.0668 0.0686 0.0719 0.0721 0.0567 0.0615 0.0705 0.0620 0.0797 0.0801 0.0911 0.0933 0.0815 0.0819 0.1009 0.1207 0.1111
va: 2.3281 2.0584 2.0871 1.9942 3.0508 3.1552 3.7128 3.9921 3.6873 3.8441 3.9346 3.9806 3.9455 3.7876 3.8716 3.9994 3.9252 3.9132 3.8532 3.8188 3.8769 3.9017 4.2638 3.9524 3.9357 3.8794 1.0090 1.0041 1.0013 1.0008 1.0058 1.0062 1.0061 0.9979 0.9966 0.9884 0.9994 1.0219 1.0171 0.9854 1.0098 1.0071 1.0185 1.0072 1.0191 1.0071 1.0073 1.0060 1.0079 0.9999 1.0002 1.0035 1.0051 0.9994 0.9982 1.0141 0.9984 0.9881
dispcorr: -0.034473656 hartree
energy: -1514.945481986940
dipole: -24.44122 23.85130 -0.58992 -20.55481 18.94967 -1.60514 -21.98064 20.50664 -1.47399
magnitude: 2.25768 au
magnitude: 5.73857 debye
