program: Orca
programVersion: 5.0.2
elementType: S O O O N N C C C C C C C C C C C C C C C C C C C C H H H H H H H H H H H H H H H H H H H H H H H H H H H H H H H H
charge: 0
multiplicity: 1
keywords: wb97x-d3
keywords: def2-TZVPP
keywords: def2/J RIJCOSX
keywords: DEFGRID2
keywords: scfconv7
keywords: smallprint printgap noloewdin
keywords: NOSOSCF
formula: C20H32N2O3S
InChI: InChI=1/C20H32N2O3S/c1-6-8-13-22(14-9-7-2)26-21(5)19(23)24-17-12-10-11-16-15-20(3,4)25-18(16)17/h10-12H,6-9,13-15H2,1-5H3
58 atoms
S  -0.383306 1.303601 -1.884718
O  2.441272 -2.430276 -0.172204
O  0.642242 -0.255757 0.230888
O  -0.746142 -2.014032 0.048002
N  -1.348139 2.398173 -1.138487
N  -0.88733 -0.283123 -1.417054
C  3.208706 -3.663067 0.028352
C  3.751558 -3.560282 1.47184
C  2.865635 -2.515044 2.076278
C  2.171541 -1.913476 1.038732
C  4.297307 -3.703781 -1.02009
C  2.239855 -4.823084 -0.117578
C  2.685194 -2.084624 3.37692
C  1.285975 -0.879706 1.279378
C  1.79458 -1.041603 3.624638
C  1.096599 -0.44453 2.582099
C  -1.08434 2.845251 0.220964
C  -2.625107 2.772531 -1.740584
C  -1.853706 2.106749 1.309185
C  -2.485159 3.923443 -2.724082
C  -1.550012 2.668833 2.691586
C  -3.812949 4.323865 -3.350432
C  -0.365939 -0.93459 -0.350024
C  -2.257726 1.911031 3.803353
C  -3.6671 5.47347 -4.33512
C  -2.022995 -0.904938 -2.085471
H  4.797426 -3.240916 1.486533
H  3.698346 -4.520443 1.98622
H  4.900271 -4.602066 -0.886483
H  4.96067 -2.84188 -0.939702
H  3.880372 -3.730708 -2.027797
H  2.768565 -5.768156 0.009083
H  1.775818 -4.82792 -1.104604
H  1.45031 -4.780735 0.635278
H  3.226838 -2.54725 4.191956
H  1.637108 -0.692821 4.636079
H  0.404084 0.365742 2.776691
H  -1.322734 3.912788 0.273369
H  -0.011626 2.762358 0.404823
H  -3.317234 3.049899 -0.941371
H  -3.073846 1.90899 -2.236311
H  -2.928951 2.175679 1.11684
H  -1.60344 1.042719 1.287928
H  -2.046119 4.784449 -2.210004
H  -1.780381 3.636376 -3.511131
H  -1.836423 3.724188 2.725881
H  -0.469575 2.641543 2.864358
H  -4.251216 3.459764 -3.858616
H  -4.518802 4.603598 -2.56269
H  -3.3414 1.937233 3.675183
H  -2.032568 2.335197 4.782575
H  -1.954589 0.862286 3.821613
H  -3.263655 6.362681 -3.847151
H  -4.625733 5.747393 -4.777174
H  -2.991483 5.211816 -5.151474
H  -1.811545 -1.94328 -2.334501
H  -2.210964 -0.371223 -3.011649
H  -2.924987 -0.865621 -1.475021
elementType: S O N C H
totalener: -1514.91237452 hartree
nucrepener: 2667.98767594 hartree
electener: -4182.90005046 hartree
oneelecener: -7375.43663056 hartree
twoeener: 3192.53658010 hartree
cpcmener: -0.03477307 hartree
kineticenergy: 1509.10562340 hartree
xcener: -129.016848777523 hartree
chargesum: -0.0000000
charge: 0.015806 -0.381049 -0.320259 -0.518453 -0.154378 -0.146330 0.376342 -0.110585 -0.125371 0.293238 -0.294892 -0.328360 -0.168474 0.033417 -0.217928 -0.112114 -0.073057 -0.092299 -0.139041 -0.082978 -0.099743 -0.089339 0.488046 -0.277005 -0.279075 -0.184405 0.092102 0.099778 0.101030 0.097022 0.100079 0.103025 0.100146 0.108659 0.152757 0.155327 0.147201 0.097551 0.091692 0.096881 0.095795 0.088104 0.046373 0.061984 0.051601 0.081536 0.061309 0.058055 0.059378 0.084126 0.092575 0.074724 0.079085 0.090375 0.078505 0.115302 0.101011 0.125194
qa: 0.0158 -0.3810 -0.3203 -0.5185 -0.1544 -0.1463 0.3763 -0.1106 -0.1254 0.2932 -0.2949 -0.3284 -0.1685 0.0334 -0.2179 -0.1121 -0.0731 -0.0923 -0.1390 -0.0830 -0.0997 -0.0893 0.4880 -0.2770 -0.2791 -0.1844 0.0921 0.0998 0.1010 0.0970 0.1001 0.1030 0.1001 0.1087 0.1528 0.1553 0.1472 0.0976 0.0917 0.0969 0.0958 0.0881 0.0464 0.0620 0.0516 0.0815 0.0613 0.0581 0.0594 0.0841 0.0926 0.0747 0.0791 0.0904 0.0785 0.1153 0.1010 0.1252
va: 2.3753 2.0809 2.0952 1.9864 3.0506 3.1768 3.6825 3.9800 3.6749 3.9037 3.9471 3.9795 3.9222 3.9147 3.9447 3.8969 3.8964 3.9033 3.8156 3.8698 3.8689 3.8842 4.2449 3.9369 3.9469 3.8892 1.0093 1.0038 1.0026 1.0057 1.0060 1.0058 1.0082 0.9985 0.9972 0.9935 0.9820 0.9966 1.0147 1.0022 0.9953 1.0151 1.0166 1.0152 1.0228 1.0057 1.0015 1.0070 1.0074 1.0008 1.0038 1.0014 1.0004 1.0040 1.0003 0.9998 1.0099 0.9858
dispcorr: -0.029963596 hartree
energy: -1514.942338119502
dipole: -19.11546 19.02958 -0.08588 17.61615 -17.02815 0.58800 -3.48077 3.77531 0.29454
magnitude: 0.66323 au
magnitude: 1.68579 debye
