program: Orca
programVersion: 5.0.2
elementType: S O O O N N C C C C C C C C C C C C C C C C C C C C H H H H H H H H H H H H H H H H H H H H H H H H H H H H H H H H
charge: 0
multiplicity: 1
keywords: wb97x-d3
keywords: def2-TZVPP
keywords: def2/J RIJCOSX
keywords: DEFGRID2
keywords: scfconv7
keywords: smallprint printgap noloewdin
keywords: NOSOSCF
formula: C20H32N2O3S
InChI: InChI=1/C20H32N2O3S/c1-6-8-13-22(14-9-7-2)26-21(5)19(23)24-17-12-10-11-16-15-20(3,4)25-18(16)17/h10-12H,6-9,13-15H2,1-5H3
58 atoms
S  -1.406403 2.687033 0.660412
O  0.83744 -1.347755 0.171674
O  1.105306 1.391207 0.95012
O  0.616429 0.151174 2.761804
N  -1.873848 1.855035 -0.689478
N  -0.919197 1.587814 1.90522
C  1.107142 -2.778072 0.005629
C  2.556506 -2.83711 -0.524101
C  3.10097 -1.50275 -0.111967
C  2.020076 -0.715962 0.251326
C  0.081634 -3.327788 -0.959531
C  0.996805 -3.415978 1.379488
C  4.381002 -0.982201 -0.082668
C  2.191401 0.596748 0.654974
C  4.559571 0.340208 0.318583
C  3.472684 1.125009 0.686172
C  -0.830283 1.406664 -1.613551
C  -3.078723 1.030306 -0.619736
C  -1.334606 1.245591 -3.040195
C  -2.838163 -0.436691 -0.279679
C  -0.196934 0.98624 -4.025172
C  -4.129752 -1.248248 -0.240033
C  0.287333 0.975261 1.937269
C  0.578754 -0.296756 -3.754505
C  -5.108629 -0.807492 0.840092
C  -1.887647 1.181583 2.91737
H  2.582678 -2.947574 -1.612072
H  3.102756 -3.679093 -0.098208
H  0.128942 -2.817836 -1.922866
H  -0.930576 -3.229715 -0.563142
H  0.269769 -4.387664 -1.131908
H  0.003074 -3.267922 1.804225
H  1.732484 -3.003873 2.073156
H  1.175191 -4.48914 1.306777
H  5.23148 -1.587449 -0.368907
H  5.553429 0.765258 0.351262
H  3.617178 2.150941 1.000145
H  -0.383127 0.470066 -1.27356
H  -0.0401 2.159272 -1.60331
H  -3.595818 1.090685 -1.582035
H  -3.741862 1.493028 0.111956
H  -2.050564 0.420635 -3.103981
H  -1.869173 2.151067 -3.338824
H  -2.174665 -0.881054 -1.026383
H  -2.320397 -0.523189 0.67978
H  0.490078 1.837605 -4.019509
H  -0.617422 0.943439 -5.032656
H  -4.617134 -1.200764 -1.218508
H  -3.871313 -2.298416 -0.08342
H  1.130245 -0.2565 -2.81372
H  1.30589 -0.487805 -4.544616
H  -0.089554 -1.159443 -3.708081
H  -5.504375 0.191701 0.655098
H  -4.632147 -0.794237 1.823159
H  -5.96196 -1.484754 0.895617
H  -2.152025 0.127303 2.829354
H  -2.788839 1.773658 2.790399
H  -1.503755 1.362952 3.921071
elementType: S O N C H
totalener: -1514.91013739 hartree
nucrepener: 2852.57436654 hartree
electener: -4367.48450394 hartree
oneelecener: -7744.22522497 hartree
twoeener: 3376.74072104 hartree
cpcmener: -0.03198159 hartree
kineticenergy: 1509.09181047 hartree
xcener: -129.017954497971 hartree
chargesum: 0.0000000
charge: 0.010444 -0.367754 -0.318691 -0.507892 -0.137306 -0.162144 0.373068 -0.127131 -0.081976 0.271681 -0.325014 -0.336632 -0.191390 0.105610 -0.150067 -0.227892 -0.075554 -0.108834 -0.112875 -0.126028 -0.105510 -0.096732 0.485557 -0.276987 -0.281609 -0.175905 0.092329 0.103980 0.101459 0.101284 0.118239 0.101080 0.110211 0.106003 0.152156 0.159070 0.150408 0.037252 0.100692 0.103996 0.103495 0.072685 0.079855 0.071361 0.072993 0.058744 0.071439 0.060849 0.069767 0.069294 0.098908 0.084567 0.082899 0.079448 0.095445 0.110009 0.102470 0.125174
qa: 0.0104 -0.3678 -0.3187 -0.5079 -0.1373 -0.1621 0.3731 -0.1271 -0.0820 0.2717 -0.3250 -0.3366 -0.1914 0.1056 -0.1501 -0.2279 -0.0756 -0.1088 -0.1129 -0.1260 -0.1055 -0.0967 0.4856 -0.2770 -0.2816 -0.1759 0.0923 0.1040 0.1015 0.1013 0.1182 0.1011 0.1102 0.1060 0.1522 0.1591 0.1504 0.0373 0.1007 0.1040 0.1035 0.0727 0.0799 0.0714 0.0730 0.0587 0.0714 0.0608 0.0698 0.0693 0.0989 0.0846 0.0829 0.0794 0.0954 0.1100 0.1025 0.1252
va: 2.3330 2.0387 2.0805 1.9968 3.0655 3.1535 3.7069 3.9917 3.6530 3.8495 3.9292 3.9776 3.9497 3.7757 3.8629 4.0056 3.9299 3.9162 3.8644 3.8316 3.9004 3.8991 4.2673 3.9296 3.9326 3.8800 1.0086 1.0046 1.0024 1.0017 1.0066 1.0072 0.9980 1.0065 0.9967 0.9881 0.9999 1.0083 1.0152 0.9913 1.0108 1.0074 1.0169 1.0135 1.0136 1.0092 1.0073 1.0091 1.0075 0.9967 1.0066 0.9992 0.9976 1.0003 1.0052 0.9874 1.0121 0.9988
dispcorr: -0.036484670 hartree
energy: -1514.946622064555
dipole: -21.48028 20.89287 -0.58741 -20.44865 18.89244 -1.55620 -18.08491 16.42191 -1.66300
magnitude: 2.35210 au
magnitude: 5.97857 debye
