program: Orca
programVersion: 5.0.2
elementType: S O O O N N C C C C C C C C C C C C C C C C C C C C H H H H H H H H H H H H H H H H H H H H H H H H H H H H H H H H
charge: 0
multiplicity: 1
keywords: wb97x-d3
keywords: def2-TZVPP
keywords: def2/J RIJCOSX
keywords: DEFGRID2
keywords: scfconv7
keywords: smallprint printgap noloewdin
keywords: NOSOSCF
formula: C20H32N2O3S
InChI: InChI=1/C20H32N2O3S/c1-6-8-13-22(14-9-7-2)26-21(5)19(23)24-17-12-10-11-16-15-20(3,4)25-18(16)17/h10-12H,6-9,13-15H2,1-5H3
58 atoms
S  -1.900486 1.519073 0.526308
O  1.602694 -1.713862 0.026104
O  0.782421 0.792591 1.12276
O  0.34234 -0.760034 2.687344
N  -2.281485 0.636974 -0.825121
N  -1.349349 0.418793 1.737784
C  2.335311 -2.966975 -0.175797
C  3.82228 -2.547596 -0.205848
C  3.790447 -1.203185 0.454806
C  2.463088 -0.813003 0.527193
C  1.854214 -3.574726 -1.473711
C  2.030968 -3.853275 1.018197
C  4.786549 -0.367792 0.923588
C  2.102632 0.398758 1.087549
C  4.430701 0.862277 1.473397
C  3.096573 1.241867 1.559497
C  -3.457398 -0.2285 -0.764322
C  -1.185551 0.130489 -1.649627
C  -4.737126 0.490852 -0.369123
C  -0.222698 1.202722 -2.130375
C  -5.069876 1.71257 -1.218842
C  -0.877819 2.315041 -2.937535
C  -0.048957 0.075945 1.902292
C  -5.127983 1.430471 -2.713081
C  0.13741 3.320938 -3.45917
C  -2.320659 -0.268488 2.583098
H  4.197117 -2.470282 -1.230432
H  4.45082 -3.270176 0.315697
H  0.789697 -3.809981 -1.433553
H  2.391808 -4.502973 -1.667893
H  2.031392 -2.904233 -2.315378
H  2.367082 -3.396098 1.950989
H  2.542127 -4.810617 0.913706
H  0.961183 -4.050655 1.098153
H  5.826907 -0.660822 0.865529
H  5.195949 1.52897 1.846522
H  2.822901 2.19414 1.995753
H  -3.291077 -1.082814 -0.09584
H  -3.582521 -0.652619 -1.762708
H  -1.647748 -0.337711 -2.522268
H  -0.634874 -0.665869 -1.135104
H  -5.544451 -0.243089 -0.4521
H  -4.704278 0.779444 0.684084
H  0.322042 1.635358 -1.289161
H  0.527818 0.698371 -2.746738
H  -4.344938 2.507988 -1.027368
H  -6.035103 2.104953 -0.889004
H  -1.43204 1.880236 -3.775369
H  -1.615952 2.834332 -2.321683
H  -5.814109 0.611392 -2.938387
H  -4.150844 1.16222 -3.118439
H  -5.472807 2.30691 -3.263258
H  0.875904 2.843491 -4.10576
H  0.679047 3.796388 -2.639139
H  -0.341897 4.111843 -4.037439
H  -3.292678 0.19191 2.43664
H  -2.059786 -0.173961 3.636436
H  -2.398732 -1.326084 2.33195
elementType: S O N C H
totalener: -1514.91030805 hartree
nucrepener: 2777.84577416 hartree
electener: -4292.75608222 hartree
oneelecener: -7595.27583369 hartree
twoeener: 3302.51975147 hartree
cpcmener: -0.03167994 hartree
kineticenergy: 1509.11062234 hartree
xcener: -129.019909053208 hartree
chargesum: 0.0000000
charge: 0.016942 -0.382272 -0.316521 -0.514611 -0.127576 -0.155990 0.367095 -0.114910 -0.087520 0.303318 -0.306033 -0.332959 -0.193244 0.071104 -0.153705 -0.214091 -0.147040 -0.133779 -0.128948 -0.122474 -0.097040 -0.068784 0.492770 -0.276295 -0.290379 -0.189627 0.091905 0.101106 0.101678 0.106928 0.098917 0.109332 0.103722 0.100846 0.152571 0.159697 0.150935 0.116866 0.109535 0.106506 0.102788 0.081806 0.075296 0.065879 0.078166 0.050726 0.073590 0.061920 0.047464 0.086651 0.071719 0.094660 0.080573 0.079994 0.090653 0.110430 0.119026 0.120682
qa: 0.0169 -0.3823 -0.3165 -0.5146 -0.1276 -0.1560 0.3671 -0.1149 -0.0875 0.3033 -0.3060 -0.3330 -0.1932 0.0711 -0.1537 -0.2141 -0.1470 -0.1338 -0.1289 -0.1225 -0.0970 -0.0688 0.4928 -0.2763 -0.2904 -0.1896 0.0919 0.1011 0.1017 0.1069 0.0989 0.1093 0.1037 0.1008 0.1526 0.1597 0.1509 0.1169 0.1095 0.1065 0.1028 0.0818 0.0753 0.0659 0.0782 0.0507 0.0736 0.0619 0.0475 0.0867 0.0717 0.0947 0.0806 0.0800 0.0907 0.1104 0.1190 0.1207
va: 2.3597 2.0572 2.0752 1.9903 2.9669 3.1932 3.7206 3.9892 3.6756 3.8489 3.9297 3.9768 3.9538 3.7576 3.8643 4.0094 3.9022 3.8951 3.8556 3.8283 3.8760 3.8617 4.2509 3.9272 3.9628 3.8887 1.0087 1.0042 1.0052 1.0033 1.0057 0.9984 1.0064 1.0083 0.9968 0.9882 0.9988 0.9939 0.9919 1.0002 1.0191 1.0139 1.0218 1.0226 1.0146 1.0162 1.0114 1.0075 1.0161 1.0022 1.0005 1.0045 1.0003 1.0001 1.0036 1.0020 1.0000 0.9892
dispcorr: -0.032850619 hartree
energy: -1514.943158672460
dipole: -19.44264 19.29029 -0.15235 -3.16867 1.90374 -1.26493 -24.77793 23.34331 -1.43461
magnitude: 1.91869 au
magnitude: 4.87693 debye
