program: Orca
programVersion: 5.0.2
elementType: S O O O N N C C C C C C C C C C C C C C C C C C C C H H H H H H H H H H H H H H H H H H H H H H H H H H H H H H H H
charge: 0
multiplicity: 1
keywords: wb97x-d3
keywords: def2-TZVPP
keywords: def2/J RIJCOSX
keywords: DEFGRID2
keywords: scfconv7
keywords: smallprint printgap noloewdin
keywords: NOSOSCF
formula: C20H32N2O3S
InChI: InChI=1/C20H32N2O3S/c1-6-8-13-22(14-9-7-2)26-21(5)19(23)24-17-12-10-11-16-15-20(3,4)25-18(16)17/h10-12H,6-9,13-15H2,1-5H3
58 atoms
S  -1.620778 2.279551 0.547799
O  0.879488 -1.555458 -0.138668
O  0.79211 0.955739 1.208361
O  -0.060813 -0.577295 2.614028
N  -1.882487 1.55971 -0.90104
N  -1.386036 1.058007 1.757122
C  1.235191 -2.924483 -0.516879
C  2.782458 -2.941658 -0.526258
C  3.129122 -1.70267 0.241898
C  1.960809 -0.978168 0.406331
C  0.625888 -3.19595 -1.874365
C  0.670883 -3.839806 0.554709
C  4.326234 -1.208069 0.724746
C  1.954412 0.228412 1.082888
C  4.330897 0.019904 1.383443
C  3.151097 0.731155 1.568909
C  -3.222286 1.154293 -1.30791
C  -0.776377 1.239524 -1.800145
C  -3.743501 -0.135056 -0.687225
C  -0.64033 2.224722 -2.9551
C  -2.827281 -1.33934 -0.845402
C  -0.308299 3.653932 -2.540859
C  -0.214594 0.39607 1.909105
C  -3.424102 -2.607932 -0.256278
C  1.040784 3.80149 -1.851569
C  -2.512452 0.578273 2.547095
H  3.179285 -2.897511 -1.544146
H  3.171741 -3.850987 -0.066686
H  0.894274 -4.19954 -2.20464
H  0.990632 -2.489522 -2.621101
H  -0.463578 -3.137209 -1.842682
H  -0.413921 -3.739524 0.624728
H  1.10125 -3.620628 1.533848
H  0.897318 -4.879377 0.316742
H  5.247305 -1.760601 0.590838
H  5.258091 0.425042 1.764986
H  3.156336 1.679683 2.090719
H  -3.206424 1.052983 -2.396018
H  -3.922127 1.964305 -1.089765
H  -0.92221 0.233129 -2.200324
H  0.148419 1.204169 -1.229059
H  -3.95575 0.027166 0.372513
H  -4.71107 -0.347497 -1.153404
H  0.144715 1.84834 -3.618859
H  -1.561497 2.220526 -3.545512
H  -1.86875 -1.137919 -0.36091
H  -2.606658 -1.497156 -1.905777
H  -0.323096 4.283967 -3.433871
H  -1.0969 4.045532 -1.892031
H  -3.624127 -2.493036 0.81115
H  -2.74887 -3.457401 -0.373196
H  -4.366807 -2.868577 -0.740955
H  1.848816 3.415347 -2.476189
H  1.076486 3.268411 -0.900488
H  1.261794 4.84881 -1.64209
H  -3.356393 1.241101 2.383039
H  -2.275103 0.597267 3.610486
H  -2.808369 -0.434976 2.27363
elementType: S O N C H
totalener: -1514.90860085 hartree
nucrepener: 2858.37870183 hartree
electener: -4373.28730268 hartree
oneelecener: -7756.29727688 hartree
twoeener: 3383.00997420 hartree
cpcmener: -0.03170381 hartree
kineticenergy: 1509.10790984 hartree
xcener: -129.024281528228 hartree
chargesum: 0.0000000
charge: 0.014063 -0.372544 -0.321689 -0.510837 -0.142464 -0.142212 0.363359 -0.111915 -0.096448 0.296042 -0.315919 -0.333781 -0.193457 0.104159 -0.146413 -0.232338 -0.100425 -0.079304 -0.134332 -0.133683 -0.067276 -0.117314 0.480244 -0.288454 -0.263282 -0.197247 0.092395 0.100279 0.114151 0.101656 0.097362 0.100166 0.110871 0.107284 0.152094 0.158675 0.150112 0.097724 0.103295 0.104508 0.084377 0.077313 0.084378 0.075057 0.073805 0.004917 0.079792 0.074513 0.056417 0.084740 0.082311 0.092589 0.082876 0.062793 0.093796 0.103729 0.127664 0.111831
qa: 0.0141 -0.3725 -0.3217 -0.5108 -0.1425 -0.1422 0.3634 -0.1119 -0.0964 0.2960 -0.3159 -0.3338 -0.1935 0.1042 -0.1464 -0.2323 -0.1004 -0.0793 -0.1343 -0.1337 -0.0673 -0.1173 0.4802 -0.2885 -0.2633 -0.1972 0.0924 0.1003 0.1142 0.1017 0.0974 0.1002 0.1109 0.1073 0.1521 0.1587 0.1501 0.0977 0.1033 0.1045 0.0844 0.0773 0.0844 0.0751 0.0738 0.0049 0.0798 0.0745 0.0564 0.0847 0.0823 0.0926 0.0829 0.0628 0.0938 0.1037 0.1277 0.1118
va: 2.3694 2.0646 2.0622 1.9919 2.9901 3.1521 3.7022 4.0007 3.6945 3.8876 3.9422 3.9883 3.9526 3.7227 3.8538 3.9979 3.9297 3.9091 3.8440 3.9119 3.8194 3.8782 4.2665 3.9404 3.9195 3.8986 1.0084 1.0043 1.0043 1.0041 1.0012 1.0025 0.9991 1.0063 0.9970 0.9884 0.9995 0.9991 1.0104 1.0034 1.0062 1.0029 1.0174 1.0140 1.0145 1.0241 1.0032 1.0121 1.0153 0.9984 1.0048 1.0029 1.0027 1.0094 1.0053 1.0096 0.9999 0.9821
dispcorr: -0.036466061 hartree
energy: -1514.945066915512
dipole: -15.02674 14.71901 -0.30773 -9.73288 8.79445 -0.93843 -20.36010 18.37228 -1.98782
magnitude: 2.21963 au
magnitude: 5.64185 debye
