program: Orca
programVersion: 5.0.2
elementType: S O O O N N C C C C C C C C C C C C C C C C C C C C H H H H H H H H H H H H H H H H H H H H H H H H H H H H H H H H
charge: 0
multiplicity: 1
keywords: wb97x-d3
keywords: def2-TZVPP
keywords: def2/J RIJCOSX
keywords: DEFGRID2
keywords: scfconv7
keywords: smallprint printgap noloewdin
keywords: NOSOSCF
formula: C20H32N2O3S
InChI: InChI=1/C20H32N2O3S/c1-6-8-13-22(14-9-7-2)26-21(5)19(23)24-17-12-10-11-16-15-20(3,4)25-18(16)17/h10-12H,6-9,13-15H2,1-5H3
58 atoms
S  -1.91015 2.281852 0.766641
O  0.823747 -1.499617 0.25566
O  0.638174 1.17547 1.280358
O  0.04733 -0.304189 2.866104
N  -2.14512 1.605877 -0.724594
N  -1.507312 1.059485 1.923859
C  1.263509 -2.657803 -0.526443
C  2.804909 -2.667259 -0.39252
C  3.099793 -1.296834 0.135578
C  1.8919 -0.722128 0.495326
C  0.827937 -2.424482 -1.961105
C  0.605009 -3.880679 0.072282
C  4.282068 -0.602646 0.312472
C  1.839051 0.551514 1.03665
C  4.235266 0.67832 0.858108
C  3.022048 1.249962 1.222627
C  -3.331718 0.785578 -0.950466
C  -0.987416 1.229837 -1.53713
C  -3.156879 -0.706329 -0.695071
C  0.010995 2.349047 -1.767188
C  -4.438352 -1.479227 -0.976624
C  1.213508 1.857959 -2.564539
C  -0.254798 0.568979 2.082778
C  -4.266341 -2.978064 -0.787352
C  2.272935 2.932913 -2.745111
C  -2.55574 0.461929 2.742191
H  3.285752 -2.867814 -1.350687
H  3.142709 -3.437199 0.305968
H  -0.255223 -2.309036 -2.030888
H  1.114554 -3.276345 -2.578685
H  1.298306 -1.534254 -2.38346
H  0.889673 -4.012155 1.116601
H  0.915995 -4.771851 -0.473195
H  -0.482552 -3.816665 0.013023
H  5.229254 -1.043072 0.028771
H  5.148915 1.238335 1.00297
H  2.988255 2.249539 1.636943
H  -3.636766 0.931688 -1.99192
H  -4.13779 1.18117 -0.329629
H  -1.385065 0.913435 -2.505502
H  -0.478886 0.354789 -1.122726
H  -2.357052 -1.101815 -1.329114
H  -2.845698 -0.880707 0.338486
H  -0.476066 3.170868 -2.30031
H  0.355016 2.757433 -0.814991
H  -4.768286 -1.27566 -1.999842
H  -5.2356 -1.114806 -0.32206
H  1.658117 0.996172 -2.056046
H  0.883458 1.496311 -3.542855
H  -3.962831 -3.216122 0.23385
H  -3.501796 -3.376137 -1.457401
H  -5.193081 -3.516452 -0.989502
H  2.66185 3.265475 -1.780618
H  1.870501 3.808098 -3.258426
H  3.1172 2.567871 -3.331159
H  -2.640335 -0.611271 2.572192
H  -3.502863 0.923302 2.480984
H  -2.375732 0.635412 3.802897
elementType: S O N C H
totalener: -1514.91259796 hartree
nucrepener: 2851.99919777 hartree
electener: -4366.91179573 hartree
oneelecener: -7742.99028484 hartree
twoeener: 3376.07848911 hartree
cpcmener: -0.03315847 hartree
kineticenergy: 1509.10541578 hartree
xcener: -129.018627507460 hartree
chargesum: 0.0000000
charge: 0.012581 -0.372742 -0.306702 -0.508600 -0.134708 -0.167497 0.357306 -0.121305 -0.112327 0.332578 -0.337730 -0.301541 -0.174384 0.079855 -0.150183 -0.239172 -0.100749 -0.052617 -0.081220 -0.144637 -0.092178 -0.057691 0.485692 -0.276509 -0.303235 -0.183226 0.100037 0.094431 0.099749 0.116916 0.109667 0.098984 0.102810 0.097362 0.152422 0.159397 0.148240 0.093305 0.095657 0.114267 0.019759 0.056735 0.065422 0.080356 0.065526 0.059176 0.062248 0.029657 0.076566 0.079589 0.076991 0.094509 0.078145 0.085927 0.092735 0.112290 0.106401 0.125668
qa: 0.0126 -0.3727 -0.3067 -0.5086 -0.1347 -0.1675 0.3573 -0.1213 -0.1123 0.3326 -0.3377 -0.3015 -0.1744 0.0799 -0.1502 -0.2392 -0.1007 -0.0526 -0.0812 -0.1446 -0.0922 -0.0577 0.4857 -0.2765 -0.3032 -0.1832 0.1000 0.0944 0.0997 0.1169 0.1097 0.0990 0.1028 0.0974 0.1524 0.1594 0.1482 0.0933 0.0957 0.1143 0.0198 0.0567 0.0654 0.0804 0.0655 0.0592 0.0622 0.0297 0.0766 0.0796 0.0770 0.0945 0.0781 0.0859 0.0927 0.1123 0.1064 0.1257
va: 2.3390 2.0528 2.0675 2.0014 3.0500 3.1485 3.7226 4.0134 3.6871 3.7936 3.9655 3.9492 3.9424 3.7089 3.8471 3.9648 3.9266 3.9021 3.7953 3.8818 3.8995 3.8519 4.2763 3.9388 3.9622 3.8812 1.0044 1.0075 1.0016 1.0082 0.9942 1.0053 1.0027 1.0052 0.9954 0.9878 1.0018 0.9997 1.0116 0.9934 1.0196 1.0205 1.0058 1.0172 1.0251 1.0090 1.0066 1.0111 1.0062 1.0001 1.0013 1.0052 1.0007 1.0007 1.0031 0.9874 1.0097 0.9974
dispcorr: -0.035965646 hartree
energy: -1514.948563610679
dipole: -11.80285 11.55655 -0.24630 -15.04541 13.82923 -1.21618 -24.10352 21.93462 -2.16889
magnitude: 2.49877 au
magnitude: 6.35137 debye
