program: Orca
programVersion: 5.0.2
elementType: S O O O N N C C C C C C C C C C C C C C C C C C C C H H H H H H H H H H H H H H H H H H H H H H H H H H H H H H H H
charge: 0
multiplicity: 1
keywords: wb97x-d3
keywords: def2-TZVPP
keywords: def2/J RIJCOSX
keywords: DEFGRID2
keywords: scfconv7
keywords: smallprint printgap noloewdin
keywords: NOSOSCF
formula: C20H32N2O3S
InChI: InChI=1/C20H32N2O3S/c1-6-8-13-22(14-9-7-2)26-21(5)19(23)24-17-12-10-11-16-15-20(3,4)25-18(16)17/h10-12H,6-9,13-15H2,1-5H3
58 atoms
S  -1.935743 2.157966 0.771768
O  1.037637 -1.487857 0.137111
O  0.655665 1.127152 1.222417
O  0.148761 -0.355579 2.833374
N  -2.245618 1.484879 -0.708113
N  -1.475128 0.930392 1.899177
C  1.577929 -2.701084 -0.482455
C  3.117398 -2.514818 -0.486884
C  3.304546 -1.173405 0.151198
C  2.051746 -0.672894 0.459949
C  1.002332 -2.780502 -1.882543
C  1.146186 -3.871694 0.377918
C  4.4383 -0.430128 0.423731
C  1.904274 0.579448 1.033173
C  4.297088 0.825282 1.00999
C  3.036793 1.327114 1.313893
C  -3.453944 0.680646 -0.873526
C  -1.127613 1.081702 -1.560608
C  -3.284839 -0.812841 -0.61038
C  -0.128299 2.189693 -1.840423
C  -4.616063 -1.558005 -0.584411
C  1.063129 1.678821 -2.641063
C  -0.200004 0.495368 2.044913
C  -5.388741 -1.496929 -1.894951
C  2.136298 2.739938 -2.825079
C  -2.486541 0.300504 2.739463
H  3.519329 -2.539031 -1.502025
H  3.617215 -3.30803 0.07275
H  1.375567 -3.671752 -2.387635
H  1.2913 -1.912562 -2.478282
H  -0.087352 -2.838691 -1.861542
H  1.546742 -3.787164 1.389308
H  1.517425 -4.802979 -0.050531
H  0.05928 -3.941926 0.439509
H  5.420708 -0.813605 0.179777
H  5.17211 1.420641 1.231927
H  2.928025 2.308292 1.758276
H  -3.806187 0.835556 -1.897278
H  -4.22081 1.09066 -0.212705
H  -1.565589 0.756328 -2.508295
H  -0.612667 0.205999 -1.152457
H  -2.638591 -1.255206 -1.375165
H  -2.776934 -0.963965 0.344815
H  -0.622774 2.998471 -2.386323
H  0.23046 2.622669 -0.904831
H  -5.236137 -1.159983 0.224644
H  -4.423924 -2.603271 -0.330959
H  1.496909 0.811647 -2.13222
H  0.725789 1.319681 -3.617743
H  -6.284422 -2.117675 -1.850369
H  -4.781596 -1.855989 -2.728549
H  -5.711583 -0.483416 -2.136142
H  1.744505 3.620066 -3.338317
H  2.975279 2.364117 -3.411827
H  2.530229 3.068303 -1.860982
H  -2.3489 0.559274 3.789704
H  -2.472286 -0.784578 2.641652
H  -3.464859 0.65469 2.429468
elementType: S O N C H
totalener: -1514.91123842 hartree
nucrepener: 2827.55981648 hartree
electener: -4342.47105490 hartree
oneelecener: -7694.26058369 hartree
twoeener: 3351.78952879 hartree
cpcmener: -0.03267441 hartree
kineticenergy: 1509.10097883 hartree
xcener: -129.017026351496 hartree
chargesum: -0.0000000
charge: 0.014035 -0.367617 -0.308295 -0.510904 -0.142424 -0.169764 0.363048 -0.148391 -0.093032 0.358358 -0.320002 -0.314911 -0.163011 0.017711 -0.164054 -0.216054 -0.098669 -0.071954 -0.118811 -0.142995 -0.109097 -0.057507 0.491756 -0.276459 -0.299423 -0.189379 0.098239 0.099107 0.115345 0.103813 0.098844 0.103954 0.103180 0.099924 0.152975 0.159412 0.149151 0.098848 0.098635 0.110706 0.044876 0.079234 0.082533 0.081805 0.063916 0.059220 0.069526 0.030800 0.075828 0.092359 0.081781 0.080910 0.085291 0.092295 0.076558 0.128948 0.112203 0.107631
qa: 0.0140 -0.3676 -0.3083 -0.5109 -0.1424 -0.1698 0.3630 -0.1484 -0.0930 0.3584 -0.3200 -0.3149 -0.1630 0.0177 -0.1641 -0.2161 -0.0987 -0.0720 -0.1188 -0.1430 -0.1091 -0.0575 0.4918 -0.2765 -0.2994 -0.1894 0.0982 0.0991 0.1153 0.1038 0.0988 0.1040 0.1032 0.0999 0.1530 0.1594 0.1492 0.0988 0.0986 0.1107 0.0449 0.0792 0.0825 0.0818 0.0639 0.0592 0.0695 0.0308 0.0758 0.0924 0.0818 0.0809 0.0853 0.0923 0.0766 0.1289 0.1122 0.1076
va: 2.3385 2.0485 2.0696 1.9993 3.0407 3.1447 3.7076 4.0695 3.6974 3.7800 3.9557 3.9692 3.9368 3.7226 3.8672 3.9659 3.8924 3.9070 3.8164 3.8731 3.9110 3.8632 4.2641 3.9340 3.9586 3.8861 1.0053 1.0045 1.0053 0.9976 1.0053 1.0004 1.0033 1.0060 0.9945 0.9878 1.0001 0.9963 1.0104 0.9956 1.0156 1.0136 1.0103 1.0164 1.0270 1.0072 1.0060 1.0090 1.0066 1.0046 0.9995 0.9983 1.0005 1.0034 1.0009 0.9969 0.9893 1.0068
dispcorr: -0.034844413 hartree
energy: -1514.946082832578
dipole: -14.00196 13.79195 -0.21001 -13.68557 12.39419 -1.29139 -24.70873 22.70930 -1.99944
magnitude: 2.38946 au
magnitude: 6.07353 debye
