program: Orca
programVersion: 5.0.2
elementType: S O O O N N C C C C C C C C C C C C C C C C C C C C H H H H H H H H H H H H H H H H H H H H H H H H H H H H H H H H
charge: 0
multiplicity: 1
keywords: wb97x-d3
keywords: def2-TZVPP
keywords: def2/J RIJCOSX
keywords: DEFGRID2
keywords: scfconv7
keywords: smallprint printgap noloewdin
keywords: NOSOSCF
formula: C20H32N2O3S
InChI: InChI=1/C20H32N2O3S/c1-6-8-13-22(14-9-7-2)26-21(5)19(23)24-17-12-10-11-16-15-20(3,4)25-18(16)17/h10-12H,6-9,13-15H2,1-5H3
58 atoms
S  -1.58303 2.652372 0.792776
O  0.825037 -1.285277 0.101589
O  0.96227 1.411957 1.053364
O  0.482853 0.075049 2.795843
N  -2.033135 1.801516 -0.555957
N  -1.052367 1.567594 2.032873
C  1.132189 -2.665831 -0.282835
C  2.630538 -2.648924 -0.667442
C  3.09923 -1.33101 -0.131115
C  1.977744 -0.618523 0.259806
C  0.224544 -3.027872 -1.43935
C  0.873395 -3.532029 0.935784
C  4.355811 -0.764434 -0.027719
C  2.08571 0.671287 0.753121
C  4.471312 0.530215 0.47352
C  3.343357 1.243476 0.862178
C  -0.985229 1.413001 -1.501495
C  -3.173763 0.892533 -0.448793
C  -1.476267 1.344556 -2.939853
C  -2.807155 -0.563039 -0.179984
C  -0.405198 0.795648 -3.879435
C  -4.030505 -1.4101 0.138752
C  0.150074 0.942427 2.019084
C  0.88359 1.606168 -3.897935
C  -3.674817 -2.87049 0.37164
C  -2.024472 1.107628 3.016775
H  2.766174 -2.698579 -1.751151
H  3.161766 -3.499054 -0.237288
H  0.456632 -4.0342 -1.788782
H  0.358857 -2.342516 -2.278073
H  -0.82602 -3.013961 -1.143599
H  1.518678 -3.249326 1.769545
H  1.072708 -4.577686 0.699891
H  -0.165261 -3.453103 1.261097
H  5.236334 -1.313028 -0.336541
H  5.445735 0.990275 0.564765
H  3.436348 2.251212 1.246645
H  -0.543791 0.449439 -1.231231
H  -0.193808 2.157291 -1.426902
H  -3.760147 0.950258 -1.370093
H  -3.820769 1.268736 0.345605
H  -2.357854 0.702906 -3.014108
H  -1.785558 2.341075 -3.268625
H  -2.29654 -0.985958 -1.050669
H  -2.099137 -0.627788 0.651239
H  -0.818831 0.752718 -4.889651
H  -0.179451 -0.238928 -3.601012
H  -4.528071 -1.00718 1.026011
H  -4.754634 -1.334318 -0.678065
H  1.415032 1.554272 -2.946609
H  0.686571 2.659413 -4.108634
H  1.565306 1.239747 -4.666371
H  -2.959467 -2.977385 1.189966
H  -3.223169 -3.314296 -0.517637
H  -4.555092 -3.462967 0.624005
H  -2.844528 1.818775 3.053058
H  -1.579935 1.061224 4.009637
H  -2.429271 0.124872 2.767861
elementType: S O N C H
totalener: -1514.91087997 hartree
nucrepener: 2853.87567136 hartree
electener: -4368.78655133 hartree
oneelecener: -7746.72876423 hartree
twoeener: 3377.94221290 hartree
cpcmener: -0.03225582 hartree
kineticenergy: 1509.08978128 hartree
xcener: -129.015931244650 hartree
chargesum: 0.0000000
charge: 0.011502 -0.367573 -0.315149 -0.507873 -0.141204 -0.164882 0.366471 -0.127460 -0.120370 0.344954 -0.319091 -0.325694 -0.179123 0.058759 -0.161645 -0.209493 -0.076628 -0.114844 -0.111433 -0.111298 -0.104035 -0.083854 0.483605 -0.275121 -0.294364 -0.167173 0.094385 0.100145 0.120230 0.104809 0.088014 0.109992 0.105607 0.097314 0.152586 0.159282 0.150580 0.035580 0.102080 0.105847 0.099536 0.078346 0.071991 0.074154 0.051999 0.073546 0.054689 0.061296 0.067118 0.076005 0.083323 0.093451 0.081467 0.083751 0.101356 0.103826 0.117532 0.113176
qa: 0.0115 -0.3676 -0.3151 -0.5079 -0.1412 -0.1649 0.3665 -0.1275 -0.1204 0.3450 -0.3191 -0.3257 -0.1791 0.0588 -0.1616 -0.2095 -0.0766 -0.1148 -0.1114 -0.1113 -0.1040 -0.0839 0.4836 -0.2751 -0.2944 -0.1672 0.0944 0.1001 0.1202 0.1048 0.0880 0.1100 0.1056 0.0973 0.1526 0.1593 0.1506 0.0356 0.1021 0.1058 0.0995 0.0783 0.0720 0.0742 0.0520 0.0735 0.0547 0.0613 0.0671 0.0760 0.0833 0.0935 0.0815 0.0838 0.1014 0.1038 0.1175 0.1132
va: 2.3241 2.0607 2.0826 1.9954 3.0621 3.1565 3.7047 4.0212 3.7005 3.8239 3.9440 3.9850 3.9400 3.7788 3.8769 3.9903 3.9424 3.9426 3.8551 3.7927 3.8952 3.8754 4.2699 3.9346 3.9349 3.8799 1.0078 1.0043 1.0070 0.9988 1.0065 0.9985 1.0055 1.0055 0.9961 0.9883 0.9994 1.0231 1.0100 0.9909 1.0108 1.0133 1.0167 1.0050 1.0126 1.0092 1.0101 1.0070 1.0088 0.9952 1.0016 1.0048 0.9984 0.9971 1.0062 1.0126 1.0018 0.9847
dispcorr: -0.036180250 hartree
energy: -1514.947060224526
dipole: -17.66309 17.16358 -0.49952 -21.04801 19.53575 -1.51226 -20.47370 18.73838 -1.73532
magnitude: 2.35537 au
magnitude: 5.98688 debye
