program: Orca
programVersion: 5.0.2
elementType: S O O O N N C C C C C C C C C C C C C C C C C C C C H H H H H H H H H H H H H H H H H H H H H H H H H H H H H H H H
charge: 0
multiplicity: 1
keywords: wb97x-d3
keywords: def2-TZVPP
keywords: def2/J RIJCOSX
keywords: DEFGRID2
keywords: scfconv7
keywords: smallprint printgap noloewdin
keywords: NOSOSCF
formula: C20H32N2O3S
InChI: InChI=1/C20H32N2O3S/c1-6-8-13-22(14-9-7-2)26-21(5)19(23)24-17-12-10-11-16-15-20(3,4)25-18(16)17/h10-12H,6-9,13-15H2,1-5H3
58 atoms
S  -0.614809 2.774196 0.407696
O  1.203815 -2.035132 -0.143317
O  0.596976 0.382881 1.33516
O  2.530235 0.57576 0.200166
N  -1.988379 2.139067 -0.241017
N  0.783476 1.971447 -0.232452
C  1.920135 -3.260362 -0.515003
C  1.839563 -4.137551 0.750281
C  1.635555 -3.11314 1.824793
C  1.265099 -1.932384 1.197067
C  3.355575 -2.867687 -0.822483
C  1.236251 -3.859909 -1.721166
C  1.730784 -3.176084 3.20098
C  1.013403 -0.786004 1.931339
C  1.458043 -2.030276 3.945649
C  1.108067 -0.84381 3.314897
C  -2.555955 0.921136 0.327068
C  -2.348437 2.411613 -1.629785
C  -2.226864 -0.38038 -0.392757
C  -2.303319 3.879894 -2.014141
C  -2.739995 -1.577228 0.399876
C  -2.85086 4.102985 -3.419652
C  1.397382 0.949698 0.412469
C  -2.542237 -2.899626 -0.321889
C  -2.812782 5.56536 -3.834708
C  1.516874 2.645553 -1.296367
H  2.743514 -4.732273 0.884381
H  0.994134 -4.830702 0.705882
H  3.850402 -2.4297 0.046539
H  3.39914 -2.149399 -1.642098
H  3.926254 -3.748536 -1.117565
H  1.758464 -4.76923 -2.01912
H  1.25238 -3.175577 -2.570436
H  0.201242 -4.125686 -1.506526
H  2.012375 -4.097214 3.694766
H  1.528026 -2.056165 5.024445
H  0.906997 0.04743 3.895663
H  -3.644218 1.043603 0.342808
H  -2.237833 0.862394 1.368578
H  -3.373419 2.050763 -1.753527
H  -1.733371 1.82809 -2.324781
H  -2.6826 -0.381583 -1.38743
H  -1.14958 -0.47422 -0.545598
H  -2.887946 4.462262 -1.29618
H  -1.278751 4.257161 -1.962952
H  -3.803387 -1.437742 0.618449
H  -2.233517 -1.60951 1.369436
H  -2.277657 3.505016 -4.134172
H  -3.879987 3.735892 -3.4721
H  -2.92158 -3.736415 0.266002
H  -1.486086 -3.088701 -0.517431
H  -3.061018 -2.909852 -1.282242
H  -1.792275 5.952412 -3.832167
H  -3.401012 6.185148 -3.155407
H  -3.215085 5.706274 -4.838592
H  0.805114 3.110903 -1.972798
H  2.106446 1.93443 -1.87012
H  2.180879 3.418233 -0.906625
elementType: S O N C H
totalener: -1514.91045611 hartree
nucrepener: 2756.99686169 hartree
electener: -4271.90731781 hartree
oneelecener: -7553.55751818 hartree
twoeener: 3281.65020038 hartree
cpcmener: -0.03206971 hartree
kineticenergy: 1509.09640542 hartree
xcener: -129.016195980810 hartree
chargesum: 0.0000000
charge: 0.016740 -0.387748 -0.309598 -0.514027 -0.148286 -0.164735 0.363360 -0.110916 -0.066669 0.245425 -0.337498 -0.306216 -0.197595 0.110816 -0.147408 -0.228856 -0.089419 -0.086301 -0.115734 -0.110701 -0.103890 -0.074266 0.497565 -0.245414 -0.289066 -0.189142 0.103318 0.090205 0.109215 0.100740 0.105704 0.108879 0.103448 0.108441 0.152719 0.159685 0.148190 0.097916 0.089520 0.097563 0.093177 0.085114 0.045473 0.069633 0.055796 0.070073 0.063008 0.058004 0.060822 0.093297 0.035383 0.083832 0.079771 0.079141 0.091014 0.113526 0.109306 0.127666
qa: 0.0167 -0.3877 -0.3096 -0.5140 -0.1483 -0.1647 0.3634 -0.1109 -0.0667 0.2454 -0.3375 -0.3062 -0.1976 0.1108 -0.1474 -0.2289 -0.0894 -0.0863 -0.1157 -0.1107 -0.1039 -0.0743 0.4976 -0.2454 -0.2891 -0.1891 0.1033 0.0902 0.1092 0.1007 0.1057 0.1089 0.1034 0.1084 0.1527 0.1597 0.1482 0.0979 0.0895 0.0976 0.0932 0.0851 0.0455 0.0696 0.0558 0.0701 0.0630 0.0580 0.0608 0.0933 0.0354 0.0838 0.0798 0.0791 0.0910 0.1135 0.1093 0.1277
va: 2.3460 2.0260 2.0800 1.9954 3.0459 3.1394 3.7330 3.9665 3.6472 3.8587 3.9715 3.9189 3.9541 3.7854 3.8604 3.9948 3.9030 3.8837 3.7710 3.8919 3.8824 3.8745 4.2319 3.9294 3.9541 3.9134 1.0050 1.0096 0.9992 1.0097 1.0073 1.0026 1.0067 0.9911 0.9970 0.9882 1.0015 0.9991 1.0151 0.9910 0.9857 1.0124 1.0363 1.0176 1.0202 1.0107 1.0050 1.0089 1.0077 1.0061 1.0187 1.0049 0.9998 0.9996 1.0039 0.9891 1.0044 0.9892
dispcorr: -0.032649114 hartree
energy: -1514.943105227245
dipole: -18.30139 17.15631 -1.14508 -1.84940 0.69505 -1.15435 -25.75778 24.79036 -0.96742
magnitude: 1.89199 au
magnitude: 4.80907 debye
