program: Orca
programVersion: 5.0.2
elementType: S O O O N N C C C C C C C C C C C C C C C C C C C C H H H H H H H H H H H H H H H H H H H H H H H H H H H H H H H H
charge: 0
multiplicity: 1
keywords: wb97x-d3
keywords: def2-TZVPP
keywords: def2/J RIJCOSX
keywords: DEFGRID2
keywords: scfconv7
keywords: smallprint printgap noloewdin
keywords: NOSOSCF
formula: C20H32N2O3S
InChI: InChI=1/C20H32N2O3S/c1-6-8-13-22(14-9-7-2)26-21(5)19(23)24-17-12-10-11-16-15-20(3,4)25-18(16)17/h10-12H,6-9,13-15H2,1-5H3
58 atoms
S  -2.117029 1.451437 0.671302
O  1.671939 -1.446691 -0.057232
O  0.58612 0.844113 1.284787
O  0.221692 -0.986728 2.535583
N  -2.300192 0.807293 -0.852671
N  -1.527313 0.215377 1.722334
C  2.542978 -2.475977 -0.630995
C  3.986846 -1.951035 -0.429233
C  3.791507 -0.721758 0.40316
C  2.429037 -0.519037 0.543907
C  2.169756 -2.613265 -2.092599
C  2.291182 -3.75312 0.146194
C  4.690785 0.171246 0.95537
C  1.937682 0.577777 1.2322
C  4.202977 1.2723 1.654796
C  2.834902 1.472767 1.793753
C  -3.348542 -0.196795 -1.045991
C  -1.083195 0.531439 -1.618841
C  -4.714909 0.186211 -0.507468
C  -0.2516 1.77042 -1.907996
C  -5.274748 1.489162 -1.060433
C  1.082334 1.440575 -2.571513
C  -0.208482 -0.05664 1.889738
C  -6.707095 1.729331 -0.608338
C  0.956807 0.739389 -3.916639
C  -2.473804 -0.690061 2.364065
H  4.462636 -1.712247 -1.383474
H  4.615753 -2.694198 0.064028
H  1.124953 -2.903839 -2.212639
H  2.785896 -3.380956 -2.561646
H  2.334928 -1.678715 -2.63167
H  2.909997 -4.55821 -0.251064
H  1.248321 -4.06459 0.071992
H  2.541885 -3.630109 1.20122
H  5.756885 0.023006 0.840975
H  4.890016 1.981797 2.095213
H  2.457992 2.333889 2.330925
H  -3.045195 -1.164517 -0.626156
H  -3.4344 -0.345945 -2.125241
H  -1.411578 0.09505 -2.563891
H  -0.474155 -0.238548 -1.130788
H  -5.387097 -0.636192 -0.770817
H  -4.709255 0.224284 0.584531
H  -0.82614 2.443005 -2.551757
H  -0.058328 2.316404 -0.98276
H  -5.231489 1.469272 -2.153735
H  -4.650535 2.328617 -0.745678
H  1.641232 2.370001 -2.704454
H  1.681892 0.824674 -1.89463
H  -6.777583 1.763574 0.480614
H  -7.370921 0.934648 -0.954106
H  -7.096772 2.673183 -0.991544
H  1.934848 0.604038 -4.380177
H  0.342997 1.319228 -4.609224
H  0.505018 -0.249603 -3.825781
H  -3.453568 -0.222502 2.366055
H  -2.193443 -0.876806 3.399325
H  -2.543817 -1.643457 1.83952
elementType: S O N C H
totalener: -1514.91154963 hartree
nucrepener: 2792.82738834 hartree
electener: -4307.73893797 hartree
oneelecener: -7625.01535123 hartree
twoeener: 3317.27641326 hartree
cpcmener: -0.03257010 hartree
kineticenergy: 1509.10001715 hartree
xcener: -129.016584280000 hartree
chargesum: -0.0000000
charge: 0.017832 -0.365640 -0.309198 -0.511150 -0.126292 -0.157686 0.377534 -0.153147 -0.077610 0.324024 -0.328910 -0.319430 -0.166648 0.020041 -0.173142 -0.198802 -0.130642 -0.139361 -0.130329 -0.101553 -0.067800 -0.099797 0.493514 -0.282663 -0.304497 -0.189115 0.097162 0.100354 0.105664 0.115377 0.101932 0.103566 0.100310 0.106074 0.152281 0.159726 0.150774 0.113674 0.104874 0.109684 0.079332 0.077230 0.072761 0.077521 0.074158 0.060681 0.050072 0.079087 0.035691 0.078933 0.079563 0.089568 0.099127 0.094661 0.078793 0.112840 0.117059 0.121943
qa: 0.0178 -0.3656 -0.3092 -0.5111 -0.1263 -0.1577 0.3775 -0.1531 -0.0776 0.3240 -0.3289 -0.3194 -0.1666 0.0200 -0.1731 -0.1988 -0.1306 -0.1394 -0.1303 -0.1016 -0.0678 -0.0998 0.4935 -0.2827 -0.3045 -0.1891 0.0972 0.1004 0.1057 0.1154 0.1019 0.1036 0.1003 0.1061 0.1523 0.1597 0.1508 0.1137 0.1049 0.1097 0.0793 0.0772 0.0728 0.0775 0.0742 0.0607 0.0501 0.0791 0.0357 0.0789 0.0796 0.0896 0.0991 0.0947 0.0788 0.1128 0.1171 0.1219
va: 2.3403 2.0489 2.0816 1.9961 3.0327 3.1782 3.6800 4.0711 3.6813 3.8021 3.9521 3.9753 3.9404 3.7773 3.8809 3.9766 3.9122 3.9358 3.8595 3.7985 3.8440 3.8955 4.2515 3.9499 3.9352 3.8859 1.0064 1.0040 1.0043 1.0063 0.9924 1.0040 1.0072 0.9990 0.9952 0.9882 0.9985 0.9926 0.9992 0.9953 1.0151 1.0141 1.0118 1.0166 1.0324 1.0106 1.0210 1.0108 1.0157 0.9999 1.0010 1.0041 1.0013 1.0035 0.9955 1.0025 1.0035 0.9868
dispcorr: -0.033829128 hartree
energy: -1514.945378753981
dipole: -16.82510 16.99585 0.17074 -6.74827 5.78616 -0.96211 -25.23648 23.43684 -1.79963
magnitude: 2.04780 au
magnitude: 5.20510 debye
