program: Orca
programVersion: 5.0.2
elementType: S O O O N N C C C C C C C C C C C C C C C C C C C C H H H H H H H H H H H H H H H H H H H H H H H H H H H H H H H H
charge: 0
multiplicity: 1
keywords: wb97x-d3
keywords: def2-TZVPP
keywords: def2/J RIJCOSX
keywords: DEFGRID2
keywords: scfconv7
keywords: smallprint printgap noloewdin
keywords: NOSOSCF
formula: C20H32N2O3S
InChI: InChI=1/C20H32N2O3S/c1-6-8-13-22(14-9-7-2)26-21(5)19(23)24-17-12-10-11-16-15-20(3,4)25-18(16)17/h10-12H,6-9,13-15H2,1-5H3
58 atoms
S  -1.081013 2.414273 0.288698
O  1.327246 -1.822063 -0.246082
O  0.545869 0.371149 1.415012
O  2.48447 0.946253 0.435546
N  -1.869588 1.608232 -0.936148
N  0.615863 2.186105 0.082196
C  1.856727 -3.078652 -0.784751
C  2.227348 -3.934424 0.452884
C  1.994533 -2.999463 1.59861
C  1.473376 -1.823504 1.086153
C  3.074699 -2.725637 -1.616092
C  0.759664 -3.708947 -1.617803
C  2.182467 -3.143752 2.960698
C  1.132801 -0.771495 1.919072
C  1.839707 -2.089444 3.803801
C  1.322926 -0.907971 3.285002
C  -1.906919 0.146355 -0.859348
C  -1.689461 2.117277 -2.297095
C  -2.619899 -0.376462 0.377743
C  -1.950798 3.603295 -2.468313
C  -2.464272 -1.883494 0.553185
C  -3.330963 4.059203 -2.017205
C  1.304983 1.148792 0.621543
C  -3.012728 -2.710625 -0.601159
C  -3.614864 5.501718 -2.408354
C  1.365617 3.09314 -0.778921
H  3.261224 -4.280821 0.402805
H  1.595859 -4.822585 0.528082
H  3.846866 -2.254619 -1.005445
H  2.816816 -2.047935 -2.43116
H  3.501397 -3.628339 -2.053822
H  1.11406 -4.64601 -2.04775
H  0.457515 -3.058087 -2.439851
H  -0.118976 -3.932583 -1.0101
H  2.584133 -4.063014 3.367466
H  1.979392 -2.183257 4.872137
H  1.057123 -0.089513 3.94184
H  -0.899554 -0.280784 -0.937294
H  -2.44158 -0.192164 -1.748406
H  -2.396667 1.570914 -2.926538
H  -0.689509 1.871425 -2.677547
H  -2.234069 0.120152 1.269995
H  -3.680868 -0.117355 0.314045
H  -1.185617 4.197768 -1.963261
H  -1.832031 3.812656 -3.535905
H  -2.968529 -2.178455 1.476473
H  -1.406708 -2.121401 0.70032
H  -4.091287 3.40487 -2.454278
H  -3.423838 3.953265 -0.934014
H  -2.942502 -3.77756 -0.386049
H  -2.468102 -2.53203 -1.529573
H  -4.064199 -2.481931 -0.786866
H  -3.583534 5.631347 -3.491813
H  -2.878975 6.182436 -1.975813
H  -4.59932 5.823344 -2.066673
H  1.601725 2.637562 -1.741293
H  2.292481 3.409243 -0.302144
H  0.766434 3.980854 -0.956047
elementType: S O N C H
totalener: -1514.91188321 hartree
nucrepener: 2783.27070157 hartree
electener: -4298.18258478 hartree
oneelecener: -7605.97507043 hartree
twoeener: 3307.79248565 hartree
cpcmener: -0.03241112 hartree
kineticenergy: 1509.09809767 hartree
xcener: -129.015465210487 hartree
chargesum: 0.0000000
charge: 0.018459 -0.367768 -0.310973 -0.511877 -0.126150 -0.157668 0.385437 -0.153238 -0.084730 0.328101 -0.318834 -0.331572 -0.165261 0.013358 -0.174995 -0.191835 -0.135040 -0.132427 -0.107510 -0.129579 -0.095160 -0.065665 0.496867 -0.308013 -0.283104 -0.186410 0.099746 0.097013 0.105935 0.100249 0.103203 0.114953 0.105451 0.102875 0.152399 0.159251 0.151019 0.080153 0.108052 0.105081 0.113823 0.074690 0.078226 0.071789 0.076268 0.078499 0.035092 0.060237 0.048961 0.099096 0.081194 0.094588 0.079352 0.079192 0.089586 0.121194 0.117101 0.111318
qa: 0.0185 -0.3678 -0.3110 -0.5119 -0.1262 -0.1577 0.3854 -0.1532 -0.0847 0.3281 -0.3188 -0.3316 -0.1653 0.0134 -0.1750 -0.1918 -0.1350 -0.1324 -0.1075 -0.1296 -0.0952 -0.0657 0.4969 -0.3080 -0.2831 -0.1864 0.0997 0.0970 0.1059 0.1002 0.1032 0.1150 0.1055 0.1029 0.1524 0.1593 0.1510 0.0802 0.1081 0.1051 0.1138 0.0747 0.0782 0.0718 0.0763 0.0785 0.0351 0.0602 0.0490 0.0991 0.0812 0.0946 0.0794 0.0792 0.0896 0.1212 0.1171 0.1113
va: 2.3431 2.0516 2.0842 1.9957 3.0309 3.1834 3.6642 4.0736 3.6901 3.8131 3.9746 3.9555 3.9380 3.7818 3.8828 3.9824 3.9290 3.9172 3.7988 3.8591 3.8943 3.8457 4.2428 3.9365 3.9512 3.8835 1.0038 1.0061 0.9991 1.0070 1.0040 1.0059 1.0048 0.9938 0.9953 0.9884 0.9978 1.0138 0.9962 0.9990 0.9929 1.0336 1.0160 1.0127 1.0142 1.0109 1.0169 1.0106 1.0202 1.0013 0.9951 1.0038 1.0011 0.9998 1.0040 0.9875 1.0026 1.0030
dispcorr: -0.033388894 hartree
energy: -1514.945272104289
dipole: -19.29741 18.72749 -0.56992 -1.58076 0.27439 -1.30637 -24.00960 22.68227 -1.32732
magnitude: 1.94761 au
magnitude: 4.95043 debye
