program: Orca
programVersion: 5.0.2
elementType: S O O O N N C C C C C C C C C C C C C C C C C C C C H H H H H H H H H H H H H H H H H H H H H H H H H H H H H H H H
charge: 0
multiplicity: 1
keywords: wb97x-d3
keywords: def2-TZVPP
keywords: def2/J RIJCOSX
keywords: DEFGRID2
keywords: scfconv7
keywords: smallprint printgap noloewdin
keywords: NOSOSCF
formula: C20H32N2O3S
InChI: InChI=1/C20H32N2O3S/c1-6-8-13-22(14-9-7-2)26-21(5)19(23)24-17-12-10-11-16-15-20(3,4)25-18(16)17/h10-12H,6-9,13-15H2,1-5H3
58 atoms
S  -0.68342 1.20333 -1.905595
O  2.390568 -2.440223 -0.279525
O  0.586965 -0.276767 0.137003
O  -0.769076 -2.070158 0.131021
N  -1.671079 2.265437 -1.13699
N  -1.069756 -0.397426 -1.378918
C  3.185976 -3.655098 -0.077059
C  3.802744 -3.495194 1.331901
C  2.94997 -2.425566 1.940825
C  2.189603 -1.874601 0.921802
C  4.219802 -3.715731 -1.178408
C  2.228026 -4.830904 -0.133532
C  2.844612 -1.937392 3.229266
C  1.308385 -0.839243 1.169852
C  1.961846 -0.889264 3.483898
C  1.195116 -0.345634 2.460459
C  -1.377326 2.719059 0.216456
C  -3.009107 2.546804 -1.652106
C  -2.041708 1.922655 1.333325
C  -3.140174 3.951722 -2.223834
C  -1.717481 2.500617 2.704894
C  -2.289864 4.188954 -3.463757
C  -0.451305 -0.996792 -0.333147
C  -2.342726 1.702702 3.837961
C  -2.453796 5.592362 -4.026093
C  -2.258642 -1.050128 -1.912867
H  4.848297 -3.178969 1.27938
H  3.776229 -4.434005 1.886252
H  3.7523 -3.779779 -2.161957
H  4.842283 -4.601132 -1.048837
H  4.873192 -2.84273 -1.158954
H  2.775632 -5.764653 -0.0032
H  1.713776 -4.875358 -1.094411
H  1.47748 -4.77295 0.657186
H  3.438275 -2.359514 4.029967
H  1.863062 -0.495999 4.486433
H  0.506006 0.466075 2.660575
H  -1.688511 3.765979 0.293276
H  -0.293946 2.713073 0.349412
H  -3.745078 2.401579 -0.856114
H  -3.250451 1.815462 -2.424519
H  -3.126847 1.914485 1.193795
H  -1.719562 0.878771 1.299172
H  -4.194397 4.114335 -2.468604
H  -2.892406 4.69105 -1.455098
H  -2.060697 3.538362 2.753626
H  -0.631581 2.533453 2.837949
H  -1.236468 4.015697 -3.229686
H  -2.556179 3.453105 -4.228772
H  -2.097056 2.128653 4.81146
H  -1.99292 0.668407 3.833537
H  -3.430911 1.681175 3.754084
H  -3.489195 5.790253 -4.309317
H  -1.836602 5.742329 -4.912785
H  -2.164024 6.348574 -3.293994
H  -3.115218 -0.936917 -1.247691
H  -2.081346 -2.110288 -2.082071
H  -2.501168 -0.595112 -2.868605
elementType: S O N C H
totalener: -1514.91208175 hartree
nucrepener: 2686.57072938 hartree
electener: -4201.48281113 hartree
oneelecener: -7412.66170480 hartree
twoeener: 3211.17889367 hartree
cpcmener: -0.03485869 hartree
kineticenergy: 1509.09939629 hartree
xcener: -129.016502589529 hartree
chargesum: -0.0000000
charge: 0.017598 -0.380629 -0.319162 -0.518396 -0.154757 -0.141049 0.377176 -0.112900 -0.122688 0.294060 -0.295614 -0.328284 -0.170003 0.029773 -0.216289 -0.120026 -0.095350 -0.090598 -0.126499 -0.107843 -0.109754 -0.075746 0.481152 -0.275451 -0.284297 -0.186843 0.092564 0.099903 0.100082 0.101107 0.097202 0.103101 0.100246 0.108578 0.153630 0.155494 0.153765 0.100197 0.094416 0.109780 0.096071 0.087590 0.048260 0.072561 0.062204 0.082496 0.063925 0.048686 0.056344 0.092808 0.075251 0.083477 0.079408 0.090298 0.078794 0.125246 0.115044 0.103889
qa: 0.0176 -0.3806 -0.3192 -0.5184 -0.1548 -0.1410 0.3772 -0.1129 -0.1227 0.2941 -0.2956 -0.3283 -0.1700 0.0298 -0.2163 -0.1200 -0.0953 -0.0906 -0.1265 -0.1078 -0.1098 -0.0757 0.4812 -0.2755 -0.2843 -0.1868 0.0926 0.0999 0.1001 0.1011 0.0972 0.1031 0.1002 0.1086 0.1536 0.1555 0.1538 0.1002 0.0944 0.1098 0.0961 0.0876 0.0483 0.0726 0.0622 0.0825 0.0639 0.0487 0.0563 0.0928 0.0753 0.0835 0.0794 0.0903 0.0788 0.1252 0.1150 0.1039
va: 2.3639 2.0815 2.0946 1.9850 3.0297 3.1886 3.6781 3.9844 3.6737 3.8992 3.9486 3.9795 3.9208 3.9206 3.9419 3.8982 3.9117 3.9230 3.8119 3.8530 3.8818 3.8508 4.2472 3.9376 3.9602 3.8899 1.0091 1.0037 1.0061 1.0027 1.0053 1.0059 1.0081 0.9987 0.9970 0.9933 0.9805 0.9957 1.0151 1.0046 1.0015 1.0161 1.0154 1.0147 1.0096 1.0048 0.9994 1.0176 1.0082 1.0038 1.0020 1.0013 1.0004 1.0031 1.0006 0.9849 1.0020 1.0098
dispcorr: -0.030714583 hartree
energy: -1514.942796329198
dipole: -16.48889 16.33286 -0.15603 17.10280 -16.57373 0.52907 -1.90794 2.22710 0.31916
magnitude: 0.63728 au
magnitude: 1.61984 debye
