program: Orca
programVersion: 5.0.2
elementType: S O O O N N C C C C C C C C C C C C C C C C C C C C H H H H H H H H H H H H H H H H H H H H H H H H H H H H H H H H
charge: 0
multiplicity: 1
keywords: wb97x-d3
keywords: def2-TZVPP
keywords: def2/J RIJCOSX
keywords: DEFGRID2
keywords: scfconv7
keywords: smallprint printgap noloewdin
keywords: NOSOSCF
formula: C20H32N2O3S
InChI: InChI=1/C20H32N2O3S/c1-6-8-13-22(14-9-7-2)26-21(5)19(23)24-17-12-10-11-16-15-20(3,4)25-18(16)17/h10-12H,6-9,13-15H2,1-5H3
58 atoms
S  -1.636225 2.351967 0.533396
O  0.75997 -1.63824 0.160547
O  0.775454 1.01717 1.186542
O  0.007031 -0.311695 2.824209
N  -1.848185 1.599821 -0.923016
N  -1.380009 1.160652 1.767373
C  1.110036 -2.952694 -0.388762
C  2.653456 -3.051431 -0.272365
C  3.040618 -1.735243 0.326612
C  1.882441 -1.007083 0.532533
C  0.640599 -2.977508 -1.829301
C  0.39932 -3.990036 0.456259
C  4.269063 -1.197746 0.665226
C  1.923979 0.266832 1.074911
C  4.317433 0.081446 1.214161
C  3.150884 0.808327 1.422902
C  -3.012882 0.740617 -1.112112
C  -0.683468 1.234427 -1.731134
C  -2.786865 -0.731096 -0.781335
C  0.316903 2.356626 -1.941764
C  -4.063289 -1.550087 -0.91439
C  -0.248755 3.585926 -2.639292
C  -0.196468 0.546822 1.993542
C  -3.828736 -3.029391 -0.649139
C  0.821974 4.625536 -2.932491
C  -2.544391 0.781669 2.557403
H  3.116491 -3.206842 -1.248912
H  2.953213 -3.889637 0.360105
H  0.887121 -3.938659 -2.281294
H  1.125955 -2.197707 -2.41841
H  -0.440496 -2.843801 -1.898958
H  0.722748 -3.941151 1.49707
H  0.624495 -4.98957 0.083371
H  -0.683649 -3.857367 0.421542
H  5.180753 -1.75829 0.503292
H  5.26902 0.518034 1.484906
H  3.19177 1.804494 1.844776
H  -3.323391 0.825639 -2.158707
H  -3.829204 1.143213 -0.508741
H  -1.079342 0.934554 -2.705989
H  -0.173335 0.355219 -1.329649
H  -2.026459 -1.14626 -1.449756
H  -2.394368 -0.836083 0.234038
H  0.770802 2.647626 -0.991594
H  1.127951 1.940532 -2.547322
H  -4.480325 -1.419662 -1.917524
H  -4.815872 -1.166204 -0.21894
H  -0.730841 3.282194 -3.573786
H  -1.031906 4.037711 -2.025584
H  -4.751016 -3.604734 -0.740418
H  -3.436565 -3.194232 0.356489
H  -3.108654 -3.448391 -1.355178
H  1.297211 4.972658 -2.012973
H  0.406913 5.498978 -3.436734
H  1.60724 4.21886 -3.572605
H  -2.810984 1.569526 3.261273
H  -2.352748 -0.128471 3.118078
H  -3.39504 0.600989 1.903545
elementType: S O N C H
totalener: -1514.90985270 hartree
nucrepener: 2827.81150292 hartree
electener: -4342.72135562 hartree
oneelecener: -7694.82757497 hartree
twoeener: 3352.10621935 hartree
cpcmener: -0.03243272 hartree
kineticenergy: 1509.10189862 hartree
xcener: -129.017981627149 hartree
chargesum: -0.0000000
charge: 0.013408 -0.367702 -0.316308 -0.512093 -0.145763 -0.145683 0.365456 -0.148406 -0.114917 0.380956 -0.330988 -0.311304 -0.168700 0.022155 -0.164393 -0.203973 -0.095818 -0.068630 -0.107105 -0.155009 -0.079712 -0.063090 0.462587 -0.289021 -0.287310 -0.187602 0.098426 0.099069 0.117969 0.109965 0.095378 0.105118 0.105534 0.093741 0.152683 0.159375 0.149892 0.095978 0.098297 0.112051 0.059286 0.065939 0.057861 0.067154 0.078885 0.061484 0.061363 0.059801 0.050889 0.099348 0.081720 0.078225 0.079425 0.090072 0.079205 0.131163 0.113902 0.109765
qa: 0.0134 -0.3677 -0.3163 -0.5121 -0.1458 -0.1457 0.3655 -0.1484 -0.1149 0.3810 -0.3310 -0.3113 -0.1687 0.0222 -0.1644 -0.2040 -0.0958 -0.0686 -0.1071 -0.1550 -0.0797 -0.0631 0.4626 -0.2890 -0.2873 -0.1876 0.0984 0.0991 0.1180 0.1100 0.0954 0.1051 0.1055 0.0937 0.1527 0.1594 0.1499 0.0960 0.0983 0.1121 0.0593 0.0659 0.0579 0.0672 0.0789 0.0615 0.0614 0.0598 0.0509 0.0993 0.0817 0.0782 0.0794 0.0901 0.0792 0.1312 0.1139 0.1098
va: 2.3290 2.0605 2.0566 1.9964 3.0009 3.1530 3.6967 4.0621 3.7086 3.8120 3.9547 3.9745 3.9300 3.7461 3.8715 3.9821 3.9211 3.8751 3.8112 3.8959 3.8841 3.8558 4.2933 3.9405 3.9517 3.8845 1.0049 1.0048 1.0052 0.9990 1.0047 1.0016 1.0036 1.0061 0.9957 0.9883 0.9992 1.0014 1.0079 0.9941 1.0263 1.0144 1.0067 1.0218 1.0120 1.0089 1.0067 1.0097 1.0188 1.0066 0.9977 0.9996 0.9998 1.0040 1.0005 0.9944 1.0162 0.9914
dispcorr: -0.034617445 hartree
energy: -1514.944470145029
dipole: -15.21347 14.95021 -0.26326 -10.70311 9.38082 -1.32229 -22.83575 20.85261 -1.98314
magnitude: 2.39804 au
magnitude: 6.09534 debye
