program: Orca
programVersion: 5.0.2
elementType: S O O O N N C C C C C C C C C C C C C C C C C C C C H H H H H H H H H H H H H H H H H H H H H H H H H H H H H H H H
charge: 0
multiplicity: 1
keywords: wb97x-d3
keywords: def2-TZVPP
keywords: def2/J RIJCOSX
keywords: DEFGRID2
keywords: scfconv7
keywords: smallprint printgap noloewdin
keywords: NOSOSCF
formula: C20H32N2O3S
InChI: InChI=1/C20H32N2O3S/c1-6-8-13-22(14-9-7-2)26-21(5)19(23)24-17-12-10-11-16-15-20(3,4)25-18(16)17/h10-12H,6-9,13-15H2,1-5H3
58 atoms
S  -1.765311 2.24052 0.893145
O  0.827716 -1.206297 -0.039018
O  0.707278 1.063474 1.647055
O  -0.119057 -0.593038 2.920852
N  -1.878092 1.543798 -0.587441
N  -1.505944 0.981877 2.052196
C  1.214738 -2.431234 -0.744866
C  2.762154 -2.466141 -0.676501
C  3.080985 -1.38904 0.314051
C  1.903608 -0.719172 0.594977
C  0.686298 -2.318676 -2.158906
C  0.595112 -3.594941 0.005656
C  4.266547 -0.978015 0.895144
C  1.880404 0.366243 1.452682
C  4.250166 0.112286 1.761833
C  3.063419 0.781348 2.041534
C  -3.16136 1.133199 -1.146121
C  -0.721315 1.531333 -1.474448
C  -3.246786 -0.336172 -1.54051
C  -0.618549 2.76841 -2.357756
C  -3.04255 -1.313114 -0.393753
C  0.659096 2.792476 -3.19138
C  -0.300355 0.400447 2.25172
C  -3.231069 -2.760384 -0.822367
C  0.77891 1.642918 -4.182825
C  -2.643772 0.375003 2.732227
H  3.211183 -2.250815 -1.649314
H  3.123592 -3.447679 -0.366176
H  0.957245 -3.209048 -2.727077
H  1.108809 -1.453157 -2.671846
H  -0.402048 -2.234109 -2.172967
H  0.844053 -4.533147 -0.491164
H  -0.492506 -3.512228 0.038601
H  0.968317 -3.65149 1.029965
H  5.195066 -1.490242 0.677991
H  5.167875 0.446775 2.225751
H  3.05555 1.631135 2.712135
H  -3.38632 1.746824 -2.025843
H  -3.933715 1.356842 -0.408721
H  -0.769238 0.628456 -2.087632
H  0.185208 1.444776 -0.877021
H  -4.238934 -0.488406 -1.977265
H  -2.535952 -0.555859 -2.343607
H  -1.489671 2.831968 -3.017398
H  -0.644445 3.655183 -1.717502
H  -3.746416 -1.077876 0.409924
H  -2.042551 -1.185446 0.029329
H  0.704827 3.739347 -3.734808
H  1.524607 2.78666 -2.521623
H  -2.531721 -3.036208 -1.61416
H  -4.239736 -2.932723 -1.203046
H  -3.0724 -3.448031 0.009445
H  0.865222 0.675717 -3.684873
H  1.662615 1.759027 -4.811545
H  -0.089757 1.596511 -4.842683
H  -2.758131 -0.677158 2.479367
H  -3.545764 0.897534 2.431422
H  -2.545907 0.466071 3.813437
elementType: S O N C H
totalener: -1514.90788191 hartree
nucrepener: 2857.32244583 hartree
electener: -4372.23032775 hartree
oneelecener: -7753.89390579 hartree
twoeener: 3381.66357804 hartree
cpcmener: -0.03298737 hartree
kineticenergy: 1509.10650943 hartree
xcener: -129.023099979037 hartree
chargesum: -0.0000000
charge: 0.014981 -0.370342 -0.325895 -0.510126 -0.140668 -0.138067 0.372169 -0.125624 -0.124612 0.335324 -0.329026 -0.329726 -0.177246 0.075360 -0.161019 -0.213905 -0.083961 -0.103372 -0.115446 -0.109480 -0.061660 -0.103149 0.474135 -0.319099 -0.268189 -0.190055 0.095392 0.099872 0.120390 0.107215 0.088635 0.107918 0.102817 0.110585 0.153086 0.159396 0.150526 0.096456 0.091999 0.085446 0.092636 0.081254 0.071415 0.070956 0.064469 0.071811 0.011430 0.070222 0.056913 0.085265 0.098310 0.096583 0.068179 0.092975 0.082872 0.108951 0.104335 0.130391
qa: 0.0150 -0.3703 -0.3259 -0.5101 -0.1407 -0.1381 0.3722 -0.1256 -0.1246 0.3353 -0.3290 -0.3297 -0.1772 0.0754 -0.1610 -0.2139 -0.0840 -0.1034 -0.1154 -0.1095 -0.0617 -0.1031 0.4741 -0.3191 -0.2682 -0.1901 0.0954 0.0999 0.1204 0.1072 0.0886 0.1079 0.1028 0.1106 0.1531 0.1594 0.1505 0.0965 0.0920 0.0854 0.0926 0.0813 0.0714 0.0710 0.0645 0.0718 0.0114 0.0702 0.0569 0.0853 0.0983 0.0966 0.0682 0.0930 0.0829 0.1090 0.1043 0.1304
va: 2.3703 2.0587 2.0743 1.9909 3.0334 3.1442 3.6826 4.0250 3.7201 3.8529 3.9627 3.9918 3.9404 3.7475 3.8748 3.9919 3.9198 3.9550 3.7945 3.9288 3.8347 3.8931 4.2784 3.9546 3.9338 3.8909 1.0071 1.0047 1.0069 0.9914 1.0064 1.0046 0.9968 0.9993 0.9958 0.9880 0.9992 0.9977 1.0108 0.9873 1.0031 1.0144 0.9989 1.0136 1.0198 1.0071 1.0218 1.0072 1.0095 0.9933 1.0044 0.9986 0.9927 1.0058 1.0024 0.9874 1.0102 0.9967
dispcorr: -0.036514175 hartree
energy: -1514.944396089360
dipole: -13.20415 12.96263 -0.24151 -13.13340 12.43366 -0.69974 -29.94857 27.60730 -2.34127
magnitude: 2.45550 au
magnitude: 6.24139 debye
