program: Orca
programVersion: 5.0.2
elementType: S O O O N N C C C C C C C C C C C C C C C C C C C C H H H H H H H H H H H H H H H H H H H H H H H H H H H H H H H H
charge: 0
multiplicity: 1
keywords: wb97x-d3
keywords: def2-TZVPP
keywords: def2/J RIJCOSX
keywords: DEFGRID2
keywords: scfconv7
keywords: smallprint printgap noloewdin
keywords: NOSOSCF
formula: C20H32N2O3S
InChI: InChI=1/C20H32N2O3S/c1-6-8-13-22(14-9-7-2)26-21(5)19(23)24-17-12-10-11-16-15-20(3,4)25-18(16)17/h10-12H,6-9,13-15H2,1-5H3
58 atoms
S  -2.146511 1.466049 0.71807
O  2.052009 -1.381346 -0.331983
O  0.574505 0.703679 1.019165
O  0.240149 -1.243124 2.093442
N  -2.509242 1.189543 -0.867078
N  -1.528217 0.021591 1.439636
C  3.062791 -2.393095 -0.647365
C  4.411581 -1.71495 -0.319364
C  3.996858 -0.568728 0.550358
C  2.617741 -0.455993 0.458522
C  2.912018 -2.749813 -2.10922
C  2.801735 -3.581517 0.26105
C  4.723107 0.320095 1.31861
C  1.940525 0.542827 1.136041
C  4.047057 1.332651 1.996091
C  2.665224 1.439039 1.908059
C  -3.66481 0.360575 -1.203736
C  -1.451105 1.234741 -1.871846
C  -4.94926 0.743805 -0.489462
C  -0.794198 -0.099217 -2.20242
C  -5.396069 2.182243 -0.707203
C  0.243891 0.016386 -3.316075
C  -0.206454 -0.254186 1.55357
C  -6.747433 2.462737 -0.06802
C  1.388226 0.97628 -3.016903
C  -2.457633 -0.974711 1.959864
H  4.910999 -1.356479 -1.223834
H  5.095355 -2.405283 0.176015
H  3.65571 -3.498435 -2.382737
H  3.065161 -1.878339 -2.747525
H  1.92658 -3.168705 -2.31865
H  3.523782 -4.372868 0.058568
H  1.802681 -3.989046 0.100692
H  2.896517 -3.306015 1.313326
H  5.799897 0.23635 1.389978
H  4.596004 2.039268 2.603234
H  2.140147 2.223152 2.438689
H  -3.456613 -0.70076 -1.026512
H  -3.816063 0.467391 -2.281683
H  -0.70806 1.955281 -1.529705
H  -1.889379 1.649556 -2.786189
H  -5.723075 0.06411 -0.859146
H  -4.866016 0.54359 0.582151
H  -0.32212 -0.515163 -1.310778
H  -1.557905 -0.817773 -2.511105
H  -5.444662 2.389914 -1.780515
H  -4.653721 2.870615 -0.296908
H  0.65134 -0.979184 -3.509203
H  -0.251179 0.32276 -4.242384
H  -7.526419 1.82311 -0.48715
H  -7.056087 3.497973 -0.218745
H  -6.71982 2.282256 1.008298
H  2.162513 0.909985 -3.78235
H  1.857199 0.756068 -2.056694
H  1.057148 2.014995 -2.986319
H  -2.497262 -1.859562 1.324499
H  -3.449835 -0.535745 1.998374
H  -2.187995 -1.27835 2.970158
elementType: S O N C H
totalener: -1514.91157895 hartree
nucrepener: 2771.02955896 hartree
electener: -4285.94113791 hartree
oneelecener: -7581.76919662 hartree
twoeener: 3295.82805871 hartree
cpcmener: -0.03288331 hartree
kineticenergy: 1509.10089659 hartree
xcener: -129.019650045166 hartree
chargesum: -0.0000000
charge: 0.013123 -0.366864 -0.315416 -0.518547 -0.146482 -0.155977 0.385037 -0.131718 -0.073836 0.248235 -0.326835 -0.327319 -0.190013 0.080487 -0.159167 -0.200779 -0.119318 -0.089226 -0.138280 -0.093650 -0.067228 -0.145396 0.500720 -0.283951 -0.289810 -0.183891 0.092278 0.101693 0.115367 0.099469 0.103979 0.103972 0.100337 0.108817 0.152187 0.159493 0.149376 0.110149 0.108161 0.093961 0.095083 0.076875 0.068833 0.040808 0.086791 0.061184 0.051074 0.078529 0.075685 0.079531 0.090631 0.079087 0.100859 0.069032 0.095793 0.122699 0.109408 0.114960
qa: 0.0131 -0.3669 -0.3154 -0.5185 -0.1465 -0.1560 0.3850 -0.1317 -0.0738 0.2482 -0.3268 -0.3273 -0.1900 0.0805 -0.1592 -0.2008 -0.1193 -0.0892 -0.1383 -0.0937 -0.0672 -0.1454 0.5007 -0.2840 -0.2898 -0.1839 0.0923 0.1017 0.1154 0.0995 0.1040 0.1040 0.1003 0.1088 0.1522 0.1595 0.1494 0.1101 0.1082 0.0940 0.0951 0.0769 0.0688 0.0408 0.0868 0.0612 0.0511 0.0785 0.0757 0.0795 0.0906 0.0791 0.1009 0.0690 0.0958 0.1227 0.1094 0.1150
va: 2.3678 2.0530 2.0895 1.9885 3.0205 3.1898 3.6869 4.0145 3.6502 3.8911 3.9379 3.9763 3.9498 3.8106 3.8714 3.9871 3.9082 3.8914 3.8960 3.8033 3.8416 3.8988 4.2172 3.9502 3.9218 3.8836 1.0086 1.0040 1.0062 0.9973 1.0035 1.0061 1.0084 0.9984 0.9967 0.9883 0.9993 0.9895 0.9919 1.0128 0.9990 1.0145 1.0146 1.0410 1.0192 1.0098 1.0201 1.0016 1.0115 1.0007 1.0037 1.0000 1.0042 1.0008 1.0006 0.9883 1.0030 1.0019
dispcorr: -0.033845031 hartree
energy: -1514.945423985138
dipole: -16.89498 16.97327 0.07829 -5.53119 4.92489 -0.60631 -22.30627 20.65087 -1.65541
magnitude: 1.76468 au
magnitude: 4.48547 debye
