program: Orca
programVersion: 5.0.2
elementType: S O O O N N C C C C C C C C C C C C C C C C C C C C H H H H H H H H H H H H H H H H H H H H H H H H H H H H H H H H
charge: 0
multiplicity: 1
keywords: wb97x-d3
keywords: def2-TZVPP
keywords: def2/J RIJCOSX
keywords: DEFGRID2
keywords: scfconv7
keywords: smallprint printgap noloewdin
keywords: NOSOSCF
formula: C20H32N2O3S
InChI: InChI=1/C20H32N2O3S/c1-6-8-13-22(14-9-7-2)26-21(5)19(23)24-17-12-10-11-16-15-20(3,4)25-18(16)17/h10-12H,6-9,13-15H2,1-5H3
58 atoms
S  -1.484441 2.746807 0.695099
O  0.962059 -1.20939 0.122369
O  1.121074 1.575216 0.750794
O  0.890011 0.429325 2.67155
N  -2.089524 1.72842 -0.461165
N  -0.754433 1.827375 1.966483
C  1.290858 -2.629762 -0.019634
C  2.72058 -2.641636 -0.605705
C  3.209451 -1.259689 -0.29448
C  2.109479 -0.513788 0.096919
C  0.258246 -3.247345 -0.935624
C  1.256162 -3.236102 1.371909
C  4.457153 -0.670262 -0.373316
C  2.231245 0.825814 0.42187
C  4.585473 0.679213 -0.050956
C  3.48029 1.422329 0.347565
C  -1.183983 1.269226 -1.515374
C  -3.158244 0.805165 -0.080731
C  -1.89267 0.996046 -2.832222
C  -2.692464 -0.600846 0.282535
C  -0.911503 0.497929 -3.886483
C  -3.829394 -1.448911 0.836428
C  0.447393 1.211172 1.858976
C  -1.574216 0.251959 -5.23227
C  -3.397402 -2.877297 1.13004
C  -1.571678 1.459783 3.118075
H  2.709973 -2.815815 -1.68542
H  3.329059 -3.427349 -0.156532
H  0.499148 -4.296706 -1.107077
H  0.237583 -2.745524 -1.904389
H  -0.741022 -3.203372 -0.499318
H  0.2703 -3.124521 1.826372
H  1.993553 -2.770843 2.029114
H  1.48327 -4.301259 1.320302
H  5.321295 -1.243712 -0.683216
H  5.553739 1.157827 -0.104087
H  3.584843 2.469704 0.600559
H  -0.638398 0.371522 -1.211701
H  -0.440791 2.051234 -1.673307
H  -3.877767 0.741631 -0.901948
H  -3.694323 1.25041 0.759267
H  -2.679576 0.247294 -2.703196
H  -2.382699 1.909227 -3.182266
H  -2.277382 -1.095878 -0.600966
H  -1.883414 -0.556966 1.017362
H  -0.442594 -0.425928 -3.533461
H  -0.101354 1.223668 -4.004578
H  -4.216052 -0.986404 1.749417
H  -4.660259 -1.458221 0.124407
H  -2.018265 1.167185 -5.627751
H  -2.369798 -0.491173 -5.15321
H  -0.857925 -0.111171 -5.970198
H  -2.57257 -2.902574 1.845477
H  -3.060654 -3.383299 0.22326
H  -4.214494 -3.465804 1.549151
H  -1.038947 1.646853 4.049653
H  -1.873785 0.411527 3.08962
H  -2.466674 2.074441 3.115635
elementType: S O N C H
totalener: -1514.91238802 hartree
nucrepener: 2826.83575116 hartree
electener: -4341.74813917 hartree
oneelecener: -7692.71616445 hartree
twoeener: 3350.96802528 hartree
cpcmener: -0.03217761 hartree
kineticenergy: 1509.09191154 hartree
xcener: -129.014974805853 hartree
chargesum: -0.0000000
charge: 0.011199 -0.369672 -0.318962 -0.508616 -0.140855 -0.164897 0.367585 -0.117712 -0.117263 0.316984 -0.309560 -0.331312 -0.186308 0.082156 -0.157901 -0.211371 -0.071550 -0.116898 -0.109364 -0.108842 -0.076616 -0.080026 0.487668 -0.285877 -0.296675 -0.168097 0.092220 0.100906 0.116366 0.101111 0.085949 0.098055 0.111204 0.106368 0.152756 0.158736 0.150811 0.044057 0.099718 0.106421 0.101281 0.068530 0.068899 0.071884 0.049958 0.056272 0.062116 0.061124 0.064743 0.080377 0.079834 0.090740 0.081535 0.084388 0.102020 0.121137 0.111368 0.101899
qa: 0.0112 -0.3697 -0.3190 -0.5086 -0.1409 -0.1649 0.3676 -0.1177 -0.1173 0.3170 -0.3096 -0.3313 -0.1863 0.0822 -0.1579 -0.2114 -0.0716 -0.1169 -0.1094 -0.1088 -0.0766 -0.0800 0.4877 -0.2859 -0.2967 -0.1681 0.0922 0.1009 0.1164 0.1011 0.0859 0.0981 0.1112 0.1064 0.1528 0.1587 0.1508 0.0441 0.0997 0.1064 0.1013 0.0685 0.0689 0.0719 0.0500 0.0563 0.0621 0.0611 0.0647 0.0804 0.0798 0.0907 0.0815 0.0844 0.1020 0.1211 0.1114 0.1019
va: 2.3244 2.0619 2.0893 1.9926 3.0491 3.1581 3.7133 3.9981 3.6884 3.8478 3.9388 3.9828 3.9444 3.7934 3.8732 3.9984 3.9310 3.9423 3.8490 3.7942 3.8787 3.8741 4.2597 3.9525 3.9371 3.8798 1.0085 1.0045 1.0070 1.0028 1.0066 1.0062 0.9985 1.0063 0.9965 0.9885 0.9991 1.0229 1.0170 0.9902 1.0090 1.0081 1.0185 1.0038 1.0150 1.0070 1.0072 1.0070 1.0090 0.9999 1.0002 1.0038 0.9986 0.9961 1.0061 0.9988 0.9863 1.0139
dispcorr: -0.034985813 hartree
energy: -1514.947373829585
dipole: -22.51412 21.90589 -0.60823 -25.12810 23.44773 -1.68037 -16.76974 15.43753 -1.33220
magnitude: 2.22898 au
magnitude: 5.66562 debye
