program: Orca
programVersion: 5.0.2
elementType: S O O O N N C C C C C C C C C C C C C C C C C C C C H H H H H H H H H H H H H H H H H H H H H H H H H H H H H H H H
charge: 0
multiplicity: 1
keywords: wb97x-d3
keywords: def2-TZVPP
keywords: def2/J RIJCOSX
keywords: DEFGRID2
keywords: scfconv7
keywords: smallprint printgap noloewdin
keywords: NOSOSCF
formula: C20H32N2O3S
InChI: InChI=1/C20H32N2O3S/c1-6-8-13-22(14-9-7-2)26-21(5)19(23)24-17-12-10-11-16-15-20(3,4)25-18(16)17/h10-12H,6-9,13-15H2,1-5H3
58 atoms
S  -1.9954 2.039356 1.421114
O  1.34929 -0.685158 -0.42275
O  0.24115 0.380517 1.997908
O  1.85327 1.758805 1.24998
N  -2.464271 1.180132 0.087111
N  -0.314754 2.443353 1.312272
C  2.257062 -1.321908 -1.379939
C  2.751943 -2.596484 -0.65957
C  2.426512 -2.307409 0.774265
C  1.602499 -1.194085 0.793214
C  3.392887 -0.345798 -1.631694
C  1.466519 -1.60932 -2.636602
C  2.759224 -2.947978 1.9530
C  1.109687 -0.689216 1.984004
C  2.257037 -2.450988 3.153601
C  1.441223 -1.326164 3.169878
C  -2.246593 -0.266594 0.092726
C  -2.423452 1.836258 -1.218326
C  -3.286117 -1.036036 -0.705368
C  -1.160785 1.573687 -2.032309
C  -3.024891 -2.535648 -0.623921
C  -1.104556 2.440859 -3.282826
C  0.68532 1.546353 1.490847
C  -4.070155 -3.354914 -1.363731
C  0.105292 2.131311 -4.150567
C  0.044593 3.734825 0.740549
H  3.815239 -2.764839 -0.834052
H  2.220447 -3.486515 -1.00791
H  3.019726 0.595063 -2.039423
H  4.09566 -0.766813 -2.351048
H  3.944553 -0.129751 -0.714694
H  1.101716 -0.689701 -3.097786
H  0.613143 -2.256905 -2.429277
H  2.101709 -2.115143 -3.364056
H  3.396169 -3.823077 1.945853
H  2.505377 -2.937733 4.086764
H  1.056103 -0.94026 4.105139
H  -2.289148 -0.598539 1.130236
H  -1.25152 -0.521118 -0.282649
H  -2.546354 2.907959 -1.051611
H  -3.29361 1.517095 -1.799253
H  -4.285528 -0.812171 -0.320906
H  -3.275374 -0.731161 -1.755946
H  -0.270671 1.757547 -1.423929
H  -1.119617 0.52026 -2.326662
H  -2.995076 -2.843093 0.425589
H  -2.032515 -2.751547 -1.031803
H  -2.019361 2.300326 -3.866441
H  -1.087822 3.495392 -2.991648
H  -5.067595 -3.186048 -0.953879
H  -3.863192 -4.423398 -1.293461
H  -4.101918 -3.095107 -2.42333
H  1.03645 2.276209 -3.59874
H  0.141715 2.773978 -5.03105
H  0.087981 1.096997 -4.499184
H  -0.784764 4.420089 0.885465
H  0.257026 3.668908 -0.327485
H  0.912812 4.153388 1.244984
elementType: S O N C H
totalener: -1514.91222871 hartree
nucrepener: 2825.77649407 hartree
electener: -4340.68872278 hartree
oneelecener: -7690.61551386 hartree
twoeener: 3349.92679108 hartree
cpcmener: -0.03182971 hartree
kineticenergy: 1509.09949910 hartree
xcener: -129.016293067243 hartree
chargesum: 0.0000000
charge: 0.012273 -0.371622 -0.315681 -0.508988 -0.139554 -0.165332 0.365176 -0.120517 -0.112126 0.316181 -0.330845 -0.308667 -0.186955 0.085228 -0.157308 -0.213822 -0.079436 -0.115622 -0.105623 -0.109469 -0.075333 -0.081202 0.484800 -0.286608 -0.293311 -0.166224 0.100319 0.092930 0.098955 0.106203 0.110557 0.086130 0.101406 0.116159 0.152053 0.159585 0.150217 0.099660 0.047065 0.099415 0.106314 0.067644 0.068037 0.052678 0.071651 0.061139 0.056674 0.065034 0.061320 0.080040 0.091182 0.079582 0.081324 0.101548 0.082124 0.104664 0.113278 0.115697
qa: 0.0123 -0.3716 -0.3157 -0.5090 -0.1396 -0.1653 0.3652 -0.1205 -0.1121 0.3162 -0.3308 -0.3087 -0.1870 0.0852 -0.1573 -0.2138 -0.0794 -0.1156 -0.1056 -0.1095 -0.0753 -0.0812 0.4848 -0.2866 -0.2933 -0.1662 0.1003 0.0929 0.0990 0.1062 0.1106 0.0861 0.1014 0.1162 0.1521 0.1596 0.1502 0.0997 0.0471 0.0994 0.1063 0.0676 0.0680 0.0527 0.0717 0.0611 0.0567 0.0650 0.0613 0.0800 0.0912 0.0796 0.0813 0.1015 0.0821 0.1047 0.1133 0.1157
va: 2.3233 2.0575 2.0869 1.9928 3.0540 3.1559 3.7177 4.0042 3.6869 3.8423 3.9817 3.9384 3.9453 3.7848 3.8721 3.9974 3.9364 3.9382 3.8483 3.7935 3.8760 3.8768 4.2659 3.9526 3.9357 3.8824 1.0044 1.0082 1.0065 1.0063 0.9984 1.0066 1.0025 1.0070 0.9967 0.9881 0.9995 1.0161 1.0203 1.0114 0.9905 1.0189 1.0080 1.0141 1.0041 1.0072 1.0073 1.0088 1.0072 1.0000 1.0036 1.0002 0.9993 1.0056 0.9971 1.0123 0.9846 1.0027
dispcorr: -0.034775459 hartree
energy: -1514.947004171036
dipole: -9.42535 9.18953 -0.23581 -7.20337 6.06259 -1.14078 -35.21951 33.34540 -1.87411
magnitude: 2.20664 au
magnitude: 5.60884 debye
