program: Orca
programVersion: 5.0.2
elementType: S O O O N N C C C C C C C C C C C C C C C C C C C C H H H H H H H H H H H H H H H H H H H H H H H H H H H H H H H H
charge: 0
multiplicity: 1
keywords: wb97x-d3
keywords: def2-TZVPP
keywords: def2/J RIJCOSX
keywords: DEFGRID2
keywords: scfconv7
keywords: smallprint printgap noloewdin
keywords: NOSOSCF
formula: C20H32N2O3S
InChI: InChI=1/C20H32N2O3S/c1-6-8-13-22(14-9-7-2)26-21(5)19(23)24-17-12-10-11-16-15-20(3,4)25-18(16)17/h10-12H,6-9,13-15H2,1-5H3
58 atoms
S  -1.901128 2.196167 0.859307
O  1.066586 -1.434791 0.186729
O  0.677266 1.143463 1.354578
O  0.115761 -0.392201 2.895909
N  -2.168027 1.562322 -0.646712
N  -1.473707 0.937852 1.965749
C  1.614601 -2.535117 -0.611515
C  3.145306 -2.474246 -0.385346
C  3.334452 -1.145268 0.278436
C  2.078349 -0.640829 0.568954
C  1.249738 -2.264503 -2.05901
C  0.991172 -3.815064 -0.099763
C  4.467458 -0.42911 0.617674
C  1.926341 0.588281 1.187536
C  4.321337 0.801515 1.253695
C  3.058197 1.306328 1.539893
C  -3.362626 0.747663 -0.86057
C  -1.026068 1.198399 -1.486954
C  -3.175778 -0.751439 -0.644589
C  -0.061045 2.344091 -1.743422
C  -4.497918 -1.513887 -0.644627
C  1.209445 1.883368 -2.452054
C  -0.206905 0.48626 2.126572
C  -5.273715 -1.415055 -1.951107
C  0.974111 1.28408 -3.831416
C  -2.510304 0.281926 2.754492
H  3.688662 -2.555031 -1.327797
H  3.489512 -3.289427 0.255958
H  0.167763 -2.206295 -2.189239
H  1.62123 -3.070371 -2.692755
H  1.693211 -1.331827 -2.413054
H  1.230848 -3.978976 0.951217
H  1.374507 -4.664122 -0.665995
H  -0.093847 -3.802602 -0.211392
H  5.453088 -0.814885 0.390974
H  5.19572 1.375652 1.527959
H  2.947559 2.269604 2.021253
H  -3.699661 0.93116 -1.884616
H  -4.145829 1.124959 -0.199506
H  -1.448478 0.865525 -2.437847
H  -0.489928 0.336095 -1.077967
H  -2.523501 -1.16099 -1.422491
H  -2.666417 -0.928252 0.305487
H  -0.561678 3.111788 -2.340904
H  0.21656 2.817532 -0.799981
H  -5.121674 -1.153368 0.179043
H  -4.292359 -2.565205 -0.429636
H  1.885473 2.73677 -2.543826
H  1.72908 1.155436 -1.820697
H  -4.663903 -1.735801 -2.798153
H  -5.609937 -0.397722 -2.155104
H  -6.161522 -2.048118 -1.927926
H  0.371148 0.37563 -3.790342
H  1.917908 1.021725 -4.311156
H  0.459151 1.990555 -4.485762
H  -3.475171 0.678167 2.457249
H  -2.379295 0.471803 3.818894
H  -2.520314 -0.794201 2.590456
elementType: S O N C H
totalener: -1514.91075249 hartree
nucrepener: 2838.50858645 hartree
electener: -4353.41933894 hartree
oneelecener: -7716.02094383 hartree
twoeener: 3362.60160489 hartree
cpcmener: -0.03313827 hartree
kineticenergy: 1509.10274010 hartree
xcener: -129.019113821379 hartree
chargesum: -0.0000000
charge: 0.014365 -0.372204 -0.309222 -0.510874 -0.143320 -0.168911 0.375838 -0.131395 -0.106528 0.337215 -0.349866 -0.307717 -0.173788 0.042389 -0.163340 -0.205577 -0.098146 -0.092610 -0.117602 -0.116651 -0.108433 -0.106491 0.493003 -0.276657 -0.296727 -0.186151 0.101032 0.095478 0.101771 0.117857 0.108263 0.099414 0.102830 0.101158 0.153226 0.159779 0.149801 0.098523 0.098887 0.115703 0.042585 0.079088 0.080894 0.078594 0.073535 0.059529 0.069242 0.081143 0.040129 0.081730 0.081357 0.092592 0.076852 0.098971 0.092801 0.106706 0.127825 0.112102
qa: 0.0144 -0.3722 -0.3092 -0.5109 -0.1433 -0.1689 0.3758 -0.1314 -0.1065 0.3372 -0.3499 -0.3077 -0.1738 0.0424 -0.1633 -0.2056 -0.0981 -0.0926 -0.1176 -0.1167 -0.1084 -0.1065 0.4930 -0.2767 -0.2967 -0.1862 0.1010 0.0955 0.1018 0.1179 0.1083 0.0994 0.1028 0.1012 0.1532 0.1598 0.1498 0.0985 0.0989 0.1157 0.0426 0.0791 0.0809 0.0786 0.0735 0.0595 0.0692 0.0811 0.0401 0.0817 0.0814 0.0926 0.0769 0.0990 0.0928 0.1067 0.1278 0.1121
va: 2.3399 2.0534 2.0731 1.9997 3.0492 3.1476 3.6831 4.0277 3.6947 3.7901 3.9720 3.9566 3.9403 3.7422 3.8699 3.9836 3.8923 3.9253 3.8147 3.8410 3.9111 3.8846 4.2617 3.9341 3.9341 3.8853 1.0037 1.0072 1.0020 1.0089 0.9887 1.0043 1.0023 1.0044 0.9949 0.9880 0.9994 0.9962 1.0101 0.9864 1.0173 1.0136 1.0119 1.0157 1.0327 1.0070 1.0062 1.0109 1.0127 0.9996 0.9983 1.0046 0.9966 1.0019 1.0036 1.0079 0.9972 0.9889
dispcorr: -0.035660994 hartree
energy: -1514.946413484696
dipole: -15.36758 15.23455 -0.13303 -14.85176 13.70438 -1.14738 -28.34714 26.23643 -2.11071
magnitude: 2.40609 au
magnitude: 6.11579 debye
