program: Orca
programVersion: 5.0.2
elementType: S O O O N N C C C C C C C C C C C C C C C C C C C C H H H H H H H H H H H H H H H H H H H H H H H H H H H H H H H H
charge: 0
multiplicity: 1
keywords: wb97x-d3
keywords: def2-TZVPP
keywords: def2/J RIJCOSX
keywords: DEFGRID2
keywords: scfconv7
keywords: smallprint printgap noloewdin
keywords: NOSOSCF
formula: C20H32N2O3S
InChI: InChI=1/C20H32N2O3S/c1-6-8-13-22(14-9-7-2)26-21(5)19(23)24-17-12-10-11-16-15-20(3,4)25-18(16)17/h10-12H,6-9,13-15H2,1-5H3
58 atoms
S  -1.905806 2.199793 0.863222
O  1.038533 -1.452334 0.227389
O  0.677511 1.155644 1.358104
O  0.123772 -0.3705 2.911975
N  -2.155612 1.540188 -0.633767
N  -1.467151 0.96725 1.995204
C  1.577557 -2.534154 -0.60253
C  3.098944 -2.51922 -0.329585
C  3.307754 -1.168953 0.284968
C  2.057378 -0.652046 0.581607
C  1.270283 -2.189964 -2.048468
C  0.900969 -3.814878 -0.169809
C  4.448314 -0.447308 0.583289
C  1.91973 0.590767 1.175511
C  4.316294 0.801071 1.187448
C  3.060179 1.314467 1.487416
C  -3.33755 0.707963 -0.847777
C  -1.006517 1.191502 -1.470823
C  -3.133169 -0.786331 -0.615814
C  -0.058846 2.35128 -1.728998
C  -4.442907 -1.569424 -0.646792
C  1.215221 1.911068 -2.444114
C  -0.201475 0.509093 2.144903
C  -5.180309 -1.497119 -1.977234
C  0.983392 1.311764 -3.824056
C  -2.498503 0.321426 2.798676
H  3.66953 -2.665575 -1.247086
H  3.390411 -3.31273 0.363525
H  1.631455 -2.98294 -2.70415
H  1.760178 -1.262096 -2.349768
H  0.196145 -2.082977 -2.208861
H  1.091407 -4.028182 0.882262
H  1.285344 -4.650528 -0.754889
H  -0.177628 -3.767177 -0.3260
H  5.4287 -0.84153 0.348725
H  5.196538 1.381481 1.427578
H  2.960689 2.290002 1.946055
H  -3.668683 0.87722 -1.876305
H  -4.131004 1.080797 -0.196565
H  -1.42232 0.849933 -2.421683
H  -0.458238 0.338789 -1.058653
H  -2.453783 -1.191367 -1.372752
H  -2.647646 -0.947915 0.349558
H  -0.573034 3.112824 -2.322905
H  0.215749 2.82676 -0.785806
H  -5.096786 -1.210167 0.153738
H  -4.227516 -2.614964 -0.413939
H  1.877424 2.775187 -2.536729
H  1.749285 1.189918 -1.816823
H  -6.052763 -2.151613 -1.97725
H  -4.537022 -1.807883 -2.802982
H  -5.534609 -0.489467 -2.19797
H  0.40458 0.387737 -3.78203
H  1.92964 1.076173 -4.312992
H  0.44458 2.007612 -4.470613
H  -2.328009 0.482724 3.862472
H  -2.546157 -0.750512 2.610176
H  -3.45955 0.754934 2.541667
elementType: S O N C H
totalener: -1514.91086920 hartree
nucrepener: 2842.91524025 hartree
electener: -4357.82610945 hartree
oneelecener: -7724.81917794 hartree
twoeener: 3366.99306849 hartree
cpcmener: -0.03316631 hartree
kineticenergy: 1509.09877168 hartree
xcener: -129.018904870182 hartree
chargesum: -0.0000000
charge: 0.013624 -0.375416 -0.308304 -0.510584 -0.142609 -0.168284 0.378087 -0.119901 -0.108982 0.325039 -0.360633 -0.303013 -0.181233 0.061950 -0.156604 -0.213778 -0.098139 -0.089001 -0.112779 -0.117051 -0.108271 -0.107213 0.491583 -0.277381 -0.295683 -0.183052 0.101417 0.093230 0.117913 0.111892 0.101968 0.097833 0.102442 0.101146 0.153078 0.159660 0.149466 0.098828 0.098570 0.116518 0.038478 0.076106 0.078952 0.078629 0.073743 0.059585 0.069426 0.081429 0.040078 0.092747 0.081750 0.081361 0.076525 0.098875 0.092260 0.125902 0.112079 0.105742
qa: 0.0136 -0.3754 -0.3083 -0.5106 -0.1426 -0.1683 0.3781 -0.1199 -0.1090 0.3250 -0.3606 -0.3030 -0.1812 0.0619 -0.1566 -0.2138 -0.0981 -0.0890 -0.1128 -0.1171 -0.1083 -0.1072 0.4916 -0.2774 -0.2957 -0.1831 0.1014 0.0932 0.1179 0.1119 0.1020 0.0978 0.1024 0.1011 0.1531 0.1597 0.1495 0.0988 0.0986 0.1165 0.0385 0.0761 0.0790 0.0786 0.0737 0.0596 0.0694 0.0814 0.0401 0.0927 0.0818 0.0814 0.0765 0.0989 0.0923 0.1259 0.1121 0.1057
va: 2.3412 2.0545 2.0729 1.9997 3.0539 3.1488 3.6850 4.0033 3.6860 3.7965 3.9758 3.9487 3.9454 3.7383 3.8637 3.9864 3.8932 3.9242 3.8166 3.8438 3.9115 3.8825 4.2641 3.9344 3.9344 3.8840 1.0038 1.0082 1.0100 0.9868 1.0007 1.0061 1.0023 1.0036 0.9953 0.9880 0.9999 0.9961 1.0102 0.9857 1.0178 1.0140 1.0134 1.0158 1.0328 1.0070 1.0060 1.0106 1.0133 1.0046 0.9995 0.9981 0.9965 1.0020 1.0036 0.9973 0.9880 1.0093
dispcorr: -0.035892785 hartree
energy: -1514.946761983934
dipole: -15.10779 14.97567 -0.13211 -14.86645 13.72542 -1.14103 -28.48101 26.36000 -2.12102
magnitude: 2.41207 au
magnitude: 6.13100 debye
