program: Orca
programVersion: 5.0.2
elementType: S O O O N N C C C C C C C C C C C C C C C C C C C C H H H H H H H H H H H H H H H H H H H H H H H H H H H H H H H H
charge: 0
multiplicity: 1
keywords: wb97x-d3
keywords: def2-TZVPP
keywords: def2/J RIJCOSX
keywords: DEFGRID2
keywords: scfconv7
keywords: smallprint printgap noloewdin
keywords: NOSOSCF
formula: C20H32N2O3S
InChI: InChI=1/C20H32N2O3S/c1-6-8-13-22(14-9-7-2)26-21(5)19(23)24-17-12-10-11-16-15-20(3,4)25-18(16)17/h10-12H,6-9,13-15H2,1-5H3
58 atoms
S  -1.506851 1.591681 0.625981
O  1.922107 -1.598767 1.909361
O  0.107966 -0.632575 -0.054032
O  2.002614 0.481761 -0.517462
N  -2.372463 1.98278 -0.746062
N  0.166985 1.601644 0.214595
C  3.033957 -2.289245 2.570756
C  3.044031 -3.705101 1.95041
C  2.240491 -3.517213 0.700419
C  1.619276 -2.282647 0.793433
C  2.754829 -2.287391 4.057126
C  4.301882 -1.526383 2.231211
C  2.017671 -4.32613 -0.398016
C  0.768975 -1.833757 -0.20021
C  1.161889 -3.878572 -1.402448
C  0.541954 -2.638373 -1.3054
C  -2.376024 0.990685 -1.822209
C  -2.263122 3.358265 -1.239413
C  -2.994734 -0.34347 -1.445788
C  -2.517318 4.432436 -0.19765
C  -2.956655 -1.31371 -2.621224
C  -2.537313 5.818349 -0.832076
C  0.847482 0.487084 -0.152957
C  -3.408832 -2.714324 -2.242471
C  -2.716423 6.925365 0.19451
C  0.892699 2.865915 0.161265
H  2.569953 -4.436356 2.611276
H  4.061234 -4.050914 1.762847
H  1.818738 -2.797647 4.286711
H  2.704214 -1.271972 4.452675
H  3.55591 -2.808264 4.58181
H  4.488739 -1.519774 1.15558
H  5.15946 -1.995652 2.714106
H  4.245791 -0.493571 2.577521
H  2.497399 -5.293174 -0.478213
H  0.978607 -4.496242 -2.270932
H  -0.122036 -2.2925 -2.087781
H  -1.363563 0.837439 -2.219735
H  -2.955248 1.422257 -2.641661
H  -3.014254 3.459601 -2.026796
H  -1.291278 3.527657 -1.721872
H  -2.469274 -0.784495 -0.596614
H  -4.029374 -0.18971 -1.126822
H  -3.472256 4.241035 0.300186
H  -1.751156 4.40961 0.58057
H  -1.938804 -1.358989 -3.020984
H  -3.581189 -0.930138 -3.433163
H  -1.605435 5.979705 -1.382184
H  -3.340758 5.869578 -1.572436
H  -4.429202 -2.713154 -1.854516
H  -2.764463 -3.140964 -1.470957
H  -3.383803 -3.387622 -3.100202
H  -1.898117 6.930431 0.916896
H  -3.64636 6.802357 0.752658
H  -2.743904 7.90793 -0.277896
H  1.868025 2.775707 0.637295
H  0.325008 3.613888 0.70634
H  1.030047 3.212448 -0.863341
elementType: S O N C H
totalener: -1514.91283502 hartree
nucrepener: 2692.62267506 hartree
electener: -4207.53551007 hartree
oneelecener: -7424.67956017 hartree
twoeener: 3217.14405010 hartree
cpcmener: -0.03449173 hartree
kineticenergy: 1509.10082918 hartree
xcener: -129.012536005562 hartree
chargesum: 0.0000000
charge: 0.019630 -0.382325 -0.316422 -0.514591 -0.125582 -0.156309 0.373379 -0.111482 -0.111244 0.280944 -0.294687 -0.328976 -0.181709 0.078574 -0.190272 -0.194692 -0.124926 -0.135205 -0.104935 -0.097251 -0.125250 -0.077765 0.494112 -0.285297 -0.288055 -0.188600 0.092693 0.100326 0.097075 0.100414 0.101302 0.109295 0.102947 0.100280 0.152879 0.157530 0.177132 0.095198 0.106295 0.104657 0.095456 0.057362 0.078188 0.070992 0.057969 0.066103 0.082693 0.058055 0.062467 0.085049 0.077456 0.092580 0.080437 0.078913 0.091021 0.118653 0.115622 0.121893
qa: 0.0196 -0.3823 -0.3164 -0.5146 -0.1256 -0.1563 0.3734 -0.1115 -0.1112 0.2809 -0.2947 -0.3290 -0.1817 0.0786 -0.1903 -0.1947 -0.1249 -0.1352 -0.1049 -0.0973 -0.1252 -0.0778 0.4941 -0.2853 -0.2881 -0.1886 0.0927 0.1003 0.0971 0.1004 0.1013 0.1093 0.1029 0.1003 0.1529 0.1575 0.1771 0.0952 0.1063 0.1047 0.0955 0.0574 0.0782 0.0710 0.0580 0.0661 0.0827 0.0581 0.0625 0.0850 0.0775 0.0926 0.0804 0.0789 0.0910 0.1187 0.1156 0.1219
va: 2.3202 2.0778 2.0978 1.9920 3.0296 3.1710 3.6856 3.9810 3.6691 3.9073 3.9481 3.9792 3.9412 3.8503 3.9083 3.9266 3.9182 3.9387 3.8128 3.8321 3.8804 3.8757 4.2452 3.9452 3.9526 3.8848 1.0095 1.0037 1.0055 1.0060 1.0024 0.9982 1.0058 1.0080 0.9973 0.9919 0.9773 1.0005 0.9987 0.9970 0.9865 1.0289 1.0203 1.0198 1.0213 1.0020 1.0069 1.0080 1.0081 1.0005 1.0004 1.0033 0.9997 0.9997 1.0039 1.0025 0.9977 0.9876
dispcorr: -0.030394348 hartree
energy: -1514.943229365137
dipole: -12.57636 12.45369 -0.12267 16.16156 -16.16366 -0.00210 -5.07792 4.93601 -0.14191
magnitude: 0.18759 au
magnitude: 0.47682 debye
