program: Orca
programVersion: 5.0.2
elementType: S O O O N N C C C C C C C C C C C C C C C C C C C C H H H H H H H H H H H H H H H H H H H H H H H H H H H H H H H H
charge: 0
multiplicity: 1
keywords: wb97x-d3
keywords: def2-TZVPP
keywords: def2/J RIJCOSX
keywords: DEFGRID2
keywords: scfconv7
keywords: smallprint printgap noloewdin
keywords: NOSOSCF
formula: C20H32N2O3S
InChI: InChI=1/C20H32N2O3S/c1-6-8-13-22(14-9-7-2)26-21(5)19(23)24-17-12-10-11-16-15-20(3,4)25-18(16)17/h10-12H,6-9,13-15H2,1-5H3
58 atoms
S  -1.7346 1.389476 0.580493
O  1.651914 -1.874288 1.990057
O  0.197328 -0.578985 -0.082514
O  2.032666 0.698651 0.131796
N  -2.308927 1.951497 -0.880959
N  -0.01967 1.563433 0.574014
C  2.65254 -2.647434 2.731523
C  2.963366 -3.865315 1.83075
C  2.413531 -3.440537 0.5040
C  1.65991 -2.297996 0.71591
C  2.039154 -3.029764 4.060891
C  3.870959 -1.757623 2.901851
C  2.505024 -3.988458 -0.761618
C  0.990722 -1.680966 -0.324908
C  1.83082 -3.371933 -1.813736
C  1.079159 -2.222891 -1.597093
C  -2.023978 1.12992 -2.057957
C  -2.190632 3.388423 -1.136302
C  -2.629168 -0.261061 -2.007002
C  -2.802491 4.275268 -0.066967
C  -2.358129 -1.026974 -3.295514
C  -2.741163 5.742564 -0.475142
C  0.829481 0.57458 0.196894
C  -2.83499 -2.468861 -3.229564
C  -3.30899 6.670804 0.586748
C  0.580905 2.850595 0.905092
H  2.462149 -4.768768 2.188975
H  4.03274 -4.078364 1.804346
H  1.783392 -2.148695 4.651056
H  2.749666 -3.621718 4.638145
H  1.138929 -3.629842 3.9229
H  4.302122 -1.48265 1.937284
H  4.638561 -2.281882 3.47175
H  3.61993 -0.842851 3.440331
H  3.088223 -4.883671 -0.935162
H  1.893413 -3.78422 -2.811469
H  0.556881 -1.744093 -2.416194
H  -0.944059 1.066578 -2.246837
H  -2.446609 1.658773 -2.915231
H  -2.713625 3.576684 -2.076992
H  -1.144896 3.675886 -1.308398
H  -2.229363 -0.82368 -1.161083
H  -3.708119 -0.180951 -1.848496
H  -3.842988 3.981118 0.098719
H  -2.286643 4.146302 0.887616
H  -1.28566 -1.00896 -3.511333
H  -2.8424 -0.515866 -4.132553
H  -1.70271 6.018201 -0.682622
H  -3.286346 5.883233 -1.413082
H  -2.3139 -3.02017 -2.444397
H  -2.658776 -2.991493 -4.170405
H  -3.904139 -2.525862 -3.017195
H  -4.351833 6.433442 0.805917
H  -3.26977 7.712877 0.267209
H  -2.750942 6.592003 1.52162
H  0.969752 3.356236 0.020651
H  1.387861 2.732724 1.627671
H  -0.17808 3.483116 1.356037
elementType: S O N C H
totalener: -1514.91320647 hartree
nucrepener: 2688.50237685 hartree
electener: -4203.41558333 hartree
oneelecener: -7416.42382494 hartree
twoeener: 3213.00824161 hartree
cpcmener: -0.03456996 hartree
kineticenergy: 1509.10442871 hartree
xcener: -129.012987632310 hartree
chargesum: 0.0000000
charge: 0.019694 -0.381692 -0.317122 -0.515862 -0.123966 -0.159685 0.375861 -0.115457 -0.109964 0.286790 -0.296865 -0.327557 -0.179801 0.063980 -0.196026 -0.178282 -0.123889 -0.138186 -0.109456 -0.094398 -0.114459 -0.077861 0.499270 -0.283671 -0.287026 -0.187589 0.092897 0.099928 0.100290 0.101602 0.097616 0.109022 0.103137 0.100231 0.153197 0.157553 0.172469 0.094091 0.104788 0.106060 0.096237 0.061005 0.076642 0.069829 0.057971 0.064013 0.077030 0.058061 0.061926 0.078161 0.091607 0.083365 0.079065 0.090507 0.079973 0.120392 0.119999 0.114554
qa: 0.0197 -0.3817 -0.3171 -0.5159 -0.1240 -0.1597 0.3759 -0.1155 -0.1100 0.2868 -0.2969 -0.3276 -0.1798 0.0640 -0.1960 -0.1783 -0.1239 -0.1382 -0.1095 -0.0944 -0.1145 -0.0779 0.4993 -0.2837 -0.2870 -0.1876 0.0929 0.0999 0.1003 0.1016 0.0976 0.1090 0.1031 0.1002 0.1532 0.1576 0.1725 0.0941 0.1048 0.1061 0.0962 0.0610 0.0766 0.0698 0.0580 0.0640 0.0770 0.0581 0.0619 0.0782 0.0916 0.0834 0.0791 0.0905 0.0800 0.1204 0.1200 0.1146
va: 2.3190 2.0787 2.0981 1.9911 3.0307 3.1702 3.6805 3.9918 3.6722 3.8981 3.9508 3.9790 3.9424 3.8598 3.9159 3.9250 3.9163 3.9404 3.8152 3.8300 3.8797 3.8757 4.2409 3.9454 3.9529 3.8851 1.0091 1.0035 1.0061 1.0025 1.0048 0.9980 1.0056 1.0080 0.9971 0.9917 0.9808 1.0000 0.9989 0.9974 0.9868 1.0265 1.0211 1.0204 1.0234 1.0043 1.0083 1.0080 1.0077 1.0005 1.0037 0.9999 0.9996 1.0039 0.9998 0.9888 1.0009 0.9977
dispcorr: -0.030181847 hartree
energy: -1514.943388321307
dipole: -13.32077 13.23457 -0.08621 15.53232 -15.57325 -0.04093 -5.30458 5.03832 -0.26626
magnitude: 0.28285 au
magnitude: 0.71894 debye
